BUILD FAILURE
| Build URL: | https://build.barrywardell.net/job/EinsteinToolkit/626/ |
| Project: | EinsteinToolkit |
| Date of build: | Fri, 09 Oct 2015 22:57:15 +0000 |
| Build duration: | 2 min 5 sec |
| Revision: | 2bc6675364560b9ae3467ca4eff373beba0730bc |
| Author: | Einstein Toolkit Git Server |
| Log: | Updated submodules: * arrangements/CactusNumerical 19a68ad...b91acaf (1): > Switch to LGPL license for SummationByParts * arrangements/CactusUtils 882d527...89e5c65 (1): > Switch to LGPL license for SystemStatistics, Trigger and Vectors * arrangements/WVUThorns 853f979...5c2b372 (3): > Replace double -> CCTK_REAL > Make the code test output directory match the parfile name > Add IllinoisGRMHD test case, including .par file and new Seed_Magnetic_Fields thorn. Also update CCTK_VInfo() statement inside driver_conserv_to_prims.C * manifest cc92681...2bc3b32 (1): > Update thornlist with new locations for AEIThorns and LSUThorns thorns |
[...truncated 2069 lines...] 6 schedule blocks. WaveToyC 7 schedule blocks. WaveToyCXX 7 schedule blocks. WaveToyExtra 3 schedule blocks. WaveToyF77 7 schedule blocks. WaveToyF90 7 schedule blocks. WaveToyFreeF90 7 schedule blocks. WeylScal4 48 schedule blocks. hwloc 0 schedule blocks. libjpeg 0 schedule blocks. pthreads 0 schedule blocks. zlib 0 schedule blocks. ------------------------------------------------------ There was 1 error during execution of the CST This must be corrected before compilation can proceed ------------------------------------------------------ ------------------------------------------------------ Warnings were generated during execution of the CST ------------------------------------------------------ CST error 1: -> Missing thorn Numerical/AEILocalInterp ------------------------------------------------------ make[1]: *** [/home/jenkins/workspace/EinsteinToolkit/configs/sim/config-data/make.thornlist] Error 1 make: *** [sim] Error 2 Build step 'Execute shell' marked build as failure Archiving artifacts Recording test results ERROR: Publisher hudson.tasks.junit.JUnitResultArchiver aborted due to exception hudson.AbortException: Test reports were found but none of them are new. Did tests run? For example, /home/jenkins/workspace/EinsteinToolkit/testresults.xml is 2 days 5 hr old at hudson.tasks.junit.TestResult.parse(TestResult.java:178) at hudson.tasks.junit.TestResult.parse(TestResult.java:146) at hudson.tasks.junit.TestResult.<init>(TestResult.java:122) at hudson.tasks.junit.JUnitParser$ParseResultCallable.invoke(JUnitParser.java:119) at hudson.tasks.junit.JUnitParser$ParseResultCallable.invoke(JUnitParser.java:93) at hudson.FilePath$FileCallableWrapper.call(FilePath.java:2688) at hudson.remoting.UserRequest.perform(UserRequest.java:121) at hudson.remoting.UserRequest.perform(UserRequest.java:49) at hudson.remoting.Request$2.run(Request.java:325) at hudson.remoting.InterceptingExecutorService$1.call(InterceptingExecutorService.java:68) at java.util.concurrent.FutureTask$Sync.innerRun(FutureTask.java:334) at java.util.concurrent.FutureTask.run(FutureTask.java:166) at java.util.concurrent.ThreadPoolExecutor.runWorker(ThreadPoolExecutor.java:1146) at java.util.concurrent.ThreadPoolExecutor$Worker.run(ThreadPoolExecutor.java:615) at java.lang.Thread.run(Thread.java:701) at ......remote call to cct(Native Method) at hudson.remoting.Channel.attachCallSiteStackTrace(Channel.java:1360) at hudson.remoting.UserResponse.retrieve(UserRequest.java:221) at hudson.remoting.Channel.call(Channel.java:753) at hudson.FilePath.act(FilePath.java:978) at hudson.FilePath.act(FilePath.java:967) at hudson.tasks.junit.JUnitParser.parseResult(JUnitParser.java:90) at hudson.tasks.junit.JUnitResultArchiver.parse(JUnitResultArchiver.java:120) at hudson.tasks.junit.JUnitResultArchiver.perform(JUnitResultArchiver.java:137) at hudson.tasks.BuildStepCompatibilityLayer.perform(BuildStepCompatibilityLayer.java:74) at hudson.tasks.BuildStepMonitor$1.perform(BuildStepMonitor.java:20) at hudson.model.AbstractBuild$AbstractBuildExecution.perform(AbstractBuild.java:761) at hudson.model.AbstractBuild$AbstractBuildExecution.performAllBuildSteps(AbstractBuild.java:721) at hudson.model.Build$BuildExecution.post2(Build.java:183) at hudson.model.AbstractBuild$AbstractBuildExecution.post(AbstractBuild.java:670) at hudson.model.Run.execute(Run.java:1766) at hudson.model.FreeStyleBuild.run(FreeStyleBuild.java:43) at hudson.model.ResourceController.execute(ResourceController.java:98) at hudson.model.Executor.run(Executor.java:374) IRC notifier plugin: Sending notification to: #cactus IRC notifier plugin: [ERROR] not connected. Cannot send message to '#cactus' [BFA] Scanning build for known causes... [BFA] No failure causes found [BFA] Done. 0s Started calculate disk usage of build Finished Calculation of disk usage of build in 0 seconds Started calculate disk usage of workspace Finished Calculation of disk usage of workspace in 5 minutes Email was triggered for: Failure - 1st Email was triggered for: Failure - Any Trigger Failure - Any was overridden by another trigger and will not send an email. Trigger Failure - Still was overridden by another trigger and will not send an email. Sending email for trigger: Failure - 1st