BUILD FAILURE

Build URL:https://jenkins.einsteintoolkit.ncsa.illinois.edu/job/EinsteinToolkit/1735/
Project:EinsteinToolkit
Date of build:Mon, 14 Sep 2020 13:42:57 +0000
Build duration:17 min

Changes

No changes


Console Output


	[...truncated 508.15 KB...]

	COMPILING CactusTest/TestPar/src/PrintStrings.c

	COMPILING CactusTest/TestPar/src/SetValues.c

	COMPILING CactusTest/TestReadWrite/src/TestC.cc

	COMPILING configs/sim/bindings/build/TestPar/cctk_ThornBindings.c

	Creating /home/jenkins/workspace/EinsteinToolkit/configs/sim/lib/libthorn_TestPar.a

	Checking status of thorn TestReduce

	COMPILING CactusTest/TestReduce/src/Reduce_Maximum.c

	COMPILING CactusTest/TestReduce/src/Reduce_Sum.c

	COMPILING CactusTest/TestReduce/src/Reduce_Maximum.F77

	COMPILING CactusTest/TestReduce/src/Reduce_Sum.F77

	COMPILING CactusTest/TestReduce/src/Initial.c

	COMPILING CactusTest/TestReadWrite/src/TestF.F90

	COMPILING configs/sim/bindings/build/TestReduce/cctk_ThornBindings.c

	Creating /home/jenkins/workspace/EinsteinToolkit/configs/sim/lib/libthorn_TestReduce.a

	Checking status of thorn TestSchedule

	COMPILING CactusTest/TestSchedule/src/TestSchedule.c

	COMPILING configs/sim/bindings/build/TestReadWrite/cctk_ThornBindings.c

	Creating /home/jenkins/workspace/EinsteinToolkit/configs/sim/lib/libthorn_TestReadWrite.a

	COMPILING configs/sim/bindings/build/TestSchedule/cctk_ThornBindings.c

	Checking status of thorn TestStrings

	Creating /home/jenkins/workspace/EinsteinToolkit/configs/sim/lib/libthorn_TestSchedule.a

	Checking status of thorn TestTable

	COMPILING CactusTest/TestTable/src/test_table.c

	COMPILING CactusTest/TestStrings/src/CRoutines.c

	In file included from /home/jenkins/workspace/EinsteinToolkit/src/include/cctk_Loop.h:13,

	from /home/jenkins/workspace/EinsteinToolkit/src/include/cctk_core.h:176,

	from /home/jenkins/workspace/EinsteinToolkit/configs/sim/bindings/include/TestTable/cctk.h:7,

	from /home/jenkins/workspace/EinsteinToolkit/configs/sim/build/TestTable/test_table.c:36:

	/home/jenkins/workspace/EinsteinToolkit/configs/sim/build/TestTable/test_table.c: In function 'test_set_get_pointers':

	/home/jenkins/workspace/EinsteinToolkit/configs/sim/build/TestTable/test_table.c:1297:11: warning: suggest parentheses around assignment used as truth value [-Wparentheses]

	1297 |   assert( ijptr_copy[0] = ijptr[0] );

	|           ^~~~~~~~~~

	/home/jenkins/workspace/EinsteinToolkit/configs/sim/build/TestTable/test_table.c:1298:11: warning: suggest parentheses around assignment used as truth value [-Wparentheses]

	1298 |   assert( ijptr_copy[1] = ijptr[1] );

	|           ^~~~~~~~~~

	/home/jenkins/workspace/EinsteinToolkit/configs/sim/build/TestTable/test_table.c: In function 'test_set_get_fpointers':

	/home/jenkins/workspace/EinsteinToolkit/configs/sim/build/TestTable/test_table.c:1340:11: warning: suggest parentheses around assignment used as truth value [-Wparentheses]

	1340 |   assert( fdptrs_copy[0] = fdptrs[0] );

	|           ^~~~~~~~~~~

	/home/jenkins/workspace/EinsteinToolkit/configs/sim/build/TestTable/test_table.c:1341:11: warning: suggest parentheses around assignment used as truth value [-Wparentheses]

	1341 |   assert( fdptrs_copy[1] = fdptrs[1] );

	|           ^~~~~~~~~~~

	COMPILING CactusTest/TestStrings/src/FCalls.F

	COMPILING configs/sim/bindings/build/TestStrings/cctk_ThornBindings.c

	Creating /home/jenkins/workspace/EinsteinToolkit/configs/sim/lib/libthorn_TestStrings.a

	Checking status of thorn TestTimers

	COMPILING CactusTest/TestTimers/src/TimeIt.c

	COMPILING configs/sim/bindings/build/TestTimers/cctk_ThornBindings.c

	Creating /home/jenkins/workspace/EinsteinToolkit/configs/sim/lib/libthorn_TestTimers.a

	Checking status of thorn TestTypes

	COMPILING CactusTest/TestTypes/src/initial.c

	COMPILING CactusTest/TestTypes/src/initial.F77

	COMPILING configs/sim/bindings/build/TestTypes/cctk_ThornBindings.c

	Creating /home/jenkins/workspace/EinsteinToolkit/configs/sim/lib/libthorn_TestTypes.a

	Checking status of thorn Time

	COMPILING CactusBase/Time/src/Courant.c

	COMPILING configs/sim/bindings/build/TestTable/cctk_ThornBindings.c

	Creating /home/jenkins/workspace/EinsteinToolkit/configs/sim/lib/libthorn_TestTable.a

	COMPILING CactusBase/Time/src/Given.c

	Checking status of thorn TimerInfo

	COMPILING CactusBase/Time/src/Initialise.c

	COMPILING CactusExamples/TimerInfo/src/TimerInfo.c

	COMPILING CactusBase/Time/src/Simple.c

	COMPILING CactusExamples/TimerInfo/src/Custom.c

	COMPILING configs/sim/bindings/build/TimerInfo/cctk_ThornBindings.c

	Creating /home/jenkins/workspace/EinsteinToolkit/configs/sim/lib/libthorn_TimerInfo.a

	Checking status of thorn TmunuBase

	COMPILING configs/sim/bindings/build/Time/cctk_ThornBindings.c

	Creating /home/jenkins/workspace/EinsteinToolkit/configs/sim/lib/libthorn_Time.a

	Checking status of thorn Trigger

	make[3]: *** No rule to make target 'ParamWarn.c.o', needed by 'make.checked'.  Stop.

	make[2]: *** [/home/jenkins/workspace/EinsteinToolkit/lib/make/make.thornlib:113: make.checked] Error 2

	make[1]: *** [/home/jenkins/workspace/EinsteinToolkit/lib/make/make.configuration:179: /home/jenkins/workspace/EinsteinToolkit/configs/sim/lib/libthorn_TmunuBase.a] Error 2

	make[1]: *** Waiting for unfinished jobs....

	COMPILING configs/sim/bindings/build/Trigger/cctk_ThornBindings.c

	COMPILING CactusUtils/Trigger/src/trigger.c

	Creating /home/jenkins/workspace/EinsteinToolkit/configs/sim/lib/libthorn_Trigger.a

	make: *** [Makefile:264: sim] Error 2

	

	real	17m38.792s

	user	30m17.016s

	sys	2m35.044s

	

	real	17m41.810s

	user	30m18.820s

	sys	2m36.096s

	Build step 'Execute shell' marked build as failure

	Archiving artifacts

	Recording test results

	ERROR: Step ?Publish JUnit test result report? failed: Test reports were found but none of them are new. Did leafNodes run?

	For example, /home/jenkins/workspace/EinsteinToolkit/testresults.xml is 1 day 19 hr old

	

	Started calculate disk usage of build

	Finished Calculation of disk usage of build in 0 seconds

	Started calculate disk usage of workspace

	Finished Calculation of disk usage of workspace in  3 second

	[Checks API] No suitable checks publisher found.

	Email was triggered for: Failure - Any

	Sending email for trigger: Failure - Any