BUILD FAILURE
Changes
| Revision: |
062bf34b9d542c380efc5ca53e8cd89b33426c2d |
| Author: | Roland Haas |
| Log: | Updated submodules
|
Artifacts
Console Output
[...truncated 89.91 KB...]
TwoPunctures_KerrProca
5 schedule blocks.
Vaidya2
10 schedule blocks.
Vectors
2 schedule blocks.
WatchDog
1 schedule blocks.
WaveBinarySource
1 schedule blocks.
WaveExtractL
17 schedule blocks.
WaveMoL
8 schedule blocks.
WaveToy1DF77
6 schedule blocks.
WaveToy2DF77
6 schedule blocks.
WaveToyC
7 schedule blocks.
WaveToyCXX
7 schedule blocks.
WaveToyExtra
3 schedule blocks.
WaveToyF77
7 schedule blocks.
WaveToyF90
7 schedule blocks.
WaveToyFreeF90
7 schedule blocks.
WeylScal4
48 schedule blocks.
hwloc
0 schedule blocks.
libjpeg
0 schedule blocks.
pthreads
0 schedule blocks.
zlib
0 schedule blocks.
------------------------------------------------------
There were 5 errors during execution of the CST
These must be corrected before compilation can proceed
------------------------------------------------------
------------------------------------------------------
Warnings were generated during execution of the CST
------------------------------------------------------
CST error in /home/jenkins/workspace/EinsteinToolkit/lib/sbin/CST (at 376)
-> Missing thorn WVUThorns_Diagnostics/Seed_Magnetic_Fields_BNS
CST error in /home/jenkins/workspace/EinsteinToolkit/lib/sbin/CST (at 376)
-> Missing thorn WVUThorns_Diagnostics/particle_tracerET
CST error in /home/jenkins/workspace/EinsteinToolkit/lib/sbin/CST (at 376)
-> Missing thorn WVUThorns_Diagnostics/smallbPoynET
CST error in /home/jenkins/workspace/EinsteinToolkit/lib/sbin/CST (at 376)
-> Missing thorn WVUThorns_Diagnostics/VolumeIntegrals_GRMHD
CST error in /home/jenkins/workspace/EinsteinToolkit/lib/sbin/CST (at 376)
-> Missing thorn WVUThorns_Diagnostics/VolumeIntegrals_vacuum
------------------------------------------------------
/home/jenkins/workspace/EinsteinToolkit/lib/make/make.configuration:214: recipe for target '/home/jenkins/workspace/EinsteinToolkit/configs/sim/config-data/make.thornlist' failed
make[1]: *** [/home/jenkins/workspace/EinsteinToolkit/configs/sim/config-data/make.thornlist] Error 1
Makefile:256: recipe for target 'sim' failed
make: *** [sim] Error 2
Build step 'Execute shell' marked build as failure
Archiving artifacts
Recording test results
ERROR: Step ?Publish JUnit test result report? failed: Test reports were found but none of them are new. Did tests run?
For example, /home/jenkins/workspace/EinsteinToolkit/testresults.xml is 20 hr old
IRC notifier plugin: Sending notification to: #cactus
IRC notifier plugin: [ERROR] not connected. Cannot send message to '#cactus'
[BFA] Scanning build for known causes...
[BFA] No failure causes found
[BFA] Done. 0s
Started calculate disk usage of build
Finished Calculation of disk usage of build in 0 seconds
Started calculate disk usage of workspace
Finished Calculation of disk usage of workspace in 6 second
Email was triggered for: Failure - 1st
Email was triggered for: Failure - Any
Trigger Failure - Any was overridden by another trigger and will not send an email.
Trigger Failure - Still was overridden by another trigger and will not send an email.
Sending email for trigger: Failure - 1st