Begin forwarded message:
From: Einstein Toolkit Jenkins jenkins@build-test.barrywardell.net Subject: EinsteinToolkit - Build #913 - Still Failing Date: 3 February 2017 00:34:01 CET To: ian.hinder@aei.mpg.de
BUILD FAILURE
Build URL: https://build-test.barrywardell.net/job/EinsteinToolkit/913/ Project: EinsteinToolkit Date of build: Thu, 02 Feb 2017 23:32:55 +0000 Build duration: 1 min 5 sec
Changes
Revision: bc368cf9a612aa80d64d7c9a5b94568ccdbaa54a Author: Einstein Toolkit Git Server Log: Updated submodules:
- arrangements/Llama c55b6b7...a59ebc8 (2):
Merge branch 'master' of https://bitbucket.org/llamacode/llama SphericalSlice: Some code cleanupConsole Output
[...truncated 2344 lines...]
Checking status of thorn HighOrderWaveTest
Checking status of thorn HydroBase
Checking status of thorn Hydro_InitExcision
Checking status of thorn IDAnalyticBH
Checking status of thorn IDAxiBrillBH
Checking status of thorn IDAxiOddBrillBH
Checking status of thorn IDConstraintViolate
Checking status of thorn IDFileADM
Checking status of thorn IDLinearWaves
Checking status of thorn IDScalarWave
Checking status of thorn IDScalarWaveC
Checking status of thorn IDScalarWaveCXX
Checking status of thorn IDScalarWaveElliptic
Checking status of thorn IDWaveMoL
Checking status of thorn ID_converter_ILGRMHD
Checking status of thorn IOASCII
Checking status of thorn IOBasic
Checking status of thorn libjpeg
Checking status of thorn InitBase
Checking status of thorn InterpToArray
Checking status of thorn LORENE
Checking status of thorn LocalInterp
Checking status of thorn LocalInterp2
Checking status of thorn LocalReduce
Checking status of thorn ML_BSSN_Test
Checking status of thorn ML_CCZ4_Test
Checking status of thorn ML_WaveToy_Test
Checking status of thorn Meudon_Bin_BH
Checking status of thorn Meudon_Bin_NS
Checking status of thorn Meudon_Mag_NS
Checking status of thorn MoL
Checking status of thorn NaNCatcher
Checking status of thorn NaNChecker
Checking status of thorn NewRad
Checking status of thorn Nice
Checking status of thorn Noise
Checking status of thorn Norms
Checking status of thorn NullDecomp
Checking status of thorn NullGrid
Checking status of thorn NullVars
Checking status of thorn OpenSSL
Checking status of thorn Outflow
Checking status of thorn PAPI
Checking status of thorn TATelliptic
Checking status of thorn PunctureTracker
Checking status of thorn ReductionTest
Checking status of thorn ReductionTest2
Checking status of thorn ReductionTest3
COMPILING arrangements/EinsteinAnalysis/PunctureTracker/src/puncture_tracker.cc
Checking status of thorn ReflectionSymmetry
Checking status of thorn RegridSyncTest
Checking status of thorn RotatingDBHIVP
Checking status of thorn SampleBoundary
/home/jenkins/workspace/EinsteinToolkit/arrangements/EinsteinAnalysis/PunctureTracker/src/puncture_tracker.cc: In function ‘void PunctureTracker::PunctureTracker_Track(cGH*)’:
/home/jenkins/workspace/EinsteinToolkit/arrangements/EinsteinAnalysis/PunctureTracker/src/puncture_tracker.cc:72:60: error: ‘CCTK_VINFO’ was not declared in this scope
double(pt_loc_y[n]), double(pt_loc_z[n]));
^
/home/jenkins/workspace/EinsteinToolkit/arrangements/EinsteinAnalysis/PunctureTracker/src/puncture_tracker.cc:188:43: error: ‘CCTK_VINFO’ was not declared in this scope
double(pt_betaz[n]));
^
/home/jenkins/workspace/EinsteinToolkit/arrangements/EinsteinAnalysis/PunctureTracker/src/puncture_tracker.cc:204:46: error: ‘CCTK_VERROR’ was not declared in this scope
double(pt_betaz[n]));
^
/home/jenkins/workspace/EinsteinToolkit/arrangements/EinsteinAnalysis/PunctureTracker/src/puncture_tracker.cc: In function ‘void PunctureTracker::PunctureTracker_SetPositions(cGH*)’:
/home/jenkins/workspace/EinsteinToolkit/arrangements/EinsteinAnalysis/PunctureTracker/src/puncture_tracker.cc:309:41: error: ‘CCTK_VINFO’ was not declared in this scope
double(pt_loc_z[n]));
^
/home/jenkins/workspace/EinsteinToolkit/arrangements/EinsteinAnalysis/PunctureTracker/src/puncture_tracker.cc:332:66: error: ‘CCTK_VINFO’ was not declared in this scope
new_reflevel_number[0], modify_puncture[0]);
^
/home/jenkins/workspace/EinsteinToolkit/arrangements/EinsteinAnalysis/PunctureTracker/src/puncture_tracker.cc:341:66: error: ‘CCTK_VINFO’ was not declared in this scope
new_reflevel_number[1], modify_puncture[1]);
^
/home/jenkins/workspace/EinsteinToolkit/configs/sim/config-data/make.config.rules:278: recipe for target 'puncture_tracker.cc.o' failed
make[3]: *** [puncture_tracker.cc.o] Error 1
/home/jenkins/workspace/EinsteinToolkit/lib/make/make.thornlib:112: recipe for target 'make.checked' failed
make[2]: *** [make.checked] Error 2
/home/jenkins/workspace/EinsteinToolkit/lib/make/make.configuration:181: recipe for target '/home/jenkins/workspace/EinsteinToolkit/configs/sim/lib/libthorn_PunctureTracker.a' failed
make[1]: *** [/home/jenkins/workspace/EinsteinToolkit/configs/sim/lib/libthorn_PunctureTracker.a] Error 2
make[1]: *** Waiting for unfinished jobs....
Makefile:256: recipe for target 'sim' failed
make: *** [sim] Error 2
Build step 'Execute shell' marked build as failure
Archiving artifacts
Recording test results
ERROR: Step ‘Publish JUnit test result report’ failed: Test reports were found but none of them are new. Did tests run?
For example, /home/jenkins/workspace/EinsteinToolkit/testresults.xml is 1 hr 1 min old
IRC notifier plugin: Sending notification to: #cactus
IRC notifier plugin: [ERROR] not connected. Cannot send message to '#cactus'
[BFA] Scanning build for known causes...
[BFA] No failure causes found
[BFA] Done. 0s
Started calculate disk usage of build
Finished Calculation of disk usage of build in 0 seconds
Started calculate disk usage of workspace
Finished Calculation of disk usage of workspace in 1 second
Email was triggered for: Failure - Any
Sending email for trigger: Failure - Any
test@lists.einsteintoolkit.org