#2371: Compile error in Ubuntu
Reporter:Jason Kodish
Status:new
Milestone:ET_2020_05
Version:ET_2019_10
Type:bug
Priority:critical
Component:Carpet

/home/,,/einstein/Cactus/configs/sim/build/EOS_Omni/nuc_eos_cxx/readtable_cactus_wrapper.cc:5:10: fatal error: cctk_Arguments_Checked.h: No such file or directory
#include "cctk_Arguments_Checked.h"
^~~~~~
compilation terminated.
/home/../einstein/Cactus/configs/sim/config-data/make.config.rules:278: recipe for target 'readtable_cactus_wrapper.cc.o' failed
make[3]: *** [readtable_cactus_wrapper.cc.o] Error 1
/home/../einstein/Cactus/lib/make/make.thornlib:112: recipe for target 'nuc_eos_cxx/make.checked' failed
make[2]: *** [nuc_eos_cxx/make.checked] Error 2

The file cctk_Arguments_Checked.hh does not even exist so the compile crashes. I have no idea how to fix this. I followed the steps on the build page.

--
Ticket URL: https://bitbucket.org/einsteintoolkit/tickets/issues/2371/compile-error-in-ubuntu