This file contains any messages produced by compilers while
running configure, to aid debugging if configure makes a mistake.

configure:922: checking host system type
configure:948: checking for mawk
configure:948: checking for gawk
configure:1017: checking whether make sets ${MAKE}
configure:1082: checking whether the C compiler (gcc -g3 -march=native -std=gnu11 -U__STRICT_ANSI__ ) works
configure:1099: gcc -o conftest -g3 -march=native -std=gnu11 -U__STRICT_ANSI__ -g3 -D_XOPEN_SOURCE -D_XOPEN_SOURCE_EXTENDED -U__STRICT_ANSI__  conftest.c  1>&5
configure:1096:1: warning: return type defaults to 'int' [-Wimplicit-int]
configure:1128: checking whether the C compiler (gcc -g3 -march=native -std=gnu11 -U__STRICT_ANSI__ ) is a cross-compiler
configure:1136: checking whether we are using GNU C
configure:1145: gcc -E conftest.c
configure:1192: checking whether the C++ compiler (g++ -g3 -march=native -std=gnu11 -U__STRICT_ANSI__ ) works
configure:1209: g++ -o conftest -g3 -march=native -std=gnu11 -U__STRICT_ANSI__ -g3 -D_XOPEN_SOURCE -D_XOPEN_SOURCE_EXTENDED -U__STRICT_ANSI__  conftest.C  1>&5
cc1plus: warning: command line option '-std=gnu11' is valid for C/ObjC but not for C++
configure:1235: checking whether the C++ compiler (g++ -g3 -march=native -std=gnu11 -U__STRICT_ANSI__ ) is a cross-compiler
configure:1243: checking whether we are using GNU C++
configure:1252: g++ -E conftest.C
configure:1304: checking for nvcc
configure:1339: checking for ranlib
configure:1465: checking for perl
configure:1502: checking for gtar
configure:1539: checking for xargs
configure:1576: checking for gzip
configure:1613: checking for gpatch
configure:1613: checking for patch
configure:1650: checking for git
configure:1687: checking for ar
configure:1724: checking for mkdir
configure:1763: checking for bash
configure:2053: checking whether the Fortran compiler (gfortran  ) works
configure:2068: gfortran -o conftest -g -march=native -fcray-pointer -ffixed-line-length-none  conftest.f  1>&5
configure:2097: checking whether the Fortran compiler (gfortran  ) is a cross-compiler
configure:2105: checking whether the Fortran compiler (gfortran  ) supports TYPE(*) for CCTK_PointerTo
configure:2130: gfortran -c -g -march=native -fcray-pointer -ffixed-line-length-none conftest.f 1>&5
configure:2170: checking how to run the C preprocessor
configure:2250: checking for ANSI C header files
configure:2263: cpp -g3 -D_XOPEN_SOURCE -D_XOPEN_SOURCE_EXTENDED -U__STRICT_ANSI__ conftest.c >/dev/null 2>conftest.out
configure:2330: gcc -o conftest -g3 -march=native -std=gnu11 -U__STRICT_ANSI__ -g3 -D_XOPEN_SOURCE -D_XOPEN_SOURCE_EXTENDED -U__STRICT_ANSI__  conftest.c  1>&5
configure: In function 'main':
configure:2325:67: warning: implicit declaration of function 'exit' [-Wimplicit-function-declaration]
configure:2325:67: warning: incompatible implicit declaration of built-in function 'exit'
configure:2325:67: note: include '<stdlib.h>' or provide a declaration of 'exit'
configure:2321:1:
configure:2325:67:
configure:2326:1: warning: incompatible implicit declaration of built-in function 'exit'
configure:2326:1: note: include '<stdlib.h>' or provide a declaration of 'exit'
configure:2357: checking for C99 features
configure:2375: gcc -c -g3 -march=native -std=gnu11 -U__STRICT_ANSI__ -g3 -D_XOPEN_SOURCE -D_XOPEN_SOURCE_EXTENDED -U__STRICT_ANSI__ conftest.c 1>&5
configure:2404: checking for M_PI
configure:2419: gcc -c -g3 -march=native -std=gnu11 -U__STRICT_ANSI__ -g3 -D_XOPEN_SOURCE -D_XOPEN_SOURCE_EXTENDED -U__STRICT_ANSI__ conftest.c 1>&5
configure:2444: checking for C strdup
configure:2457: gcc -c -g3 -march=native -std=gnu11 -U__STRICT_ANSI__ -g3 -D_XOPEN_SOURCE -D_XOPEN_SOURCE_EXTENDED -U__STRICT_ANSI__ conftest.c 1>&5
configure:2492: checking for C++ strdup
configure:2505: g++ -c -g3 -march=native -std=gnu11 -U__STRICT_ANSI__ -g3 -D_XOPEN_SOURCE -D_XOPEN_SOURCE_EXTENDED -U__STRICT_ANSI__ conftest.C 1>&5
cc1plus: warning: command line option '-std=gnu11' is valid for C/ObjC but not for C++
configure:2545: checking whether byte ordering is bigendian
configure:2563: gcc -c -g3 -march=native -std=gnu11 -U__STRICT_ANSI__ -g3 -D_XOPEN_SOURCE -D_XOPEN_SOURCE_EXTENDED -U__STRICT_ANSI__ conftest.c 1>&5
configure: In function 'main':
configure:2558:2: error: unknown type name 'bogus'
configure:2558:15: error: expected '=', ',', ';', 'asm' or '__attribute__' before 'macros'
configure: failed program was:
#line 2552 "configure"
#include "confdefs.h"
#include <sys/types.h>
#include <sys/param.h>
int main() {

#if !BYTE_ORDER || !BIG_ENDIAN || !LITTLE_ENDIAN
 bogus endian macros
#endif
; return 0; }
configure:2611: gcc -o conftest -g3 -march=native -std=gnu11 -U__STRICT_ANSI__ -g3 -D_XOPEN_SOURCE -D_XOPEN_SOURCE_EXTENDED -U__STRICT_ANSI__  conftest.c  1>&5
configure:2599:1: warning: return type defaults to 'int' [-Wimplicit-int]
configure: In function 'main':
configure:2607:3: warning: implicit declaration of function 'exit' [-Wimplicit-function-declaration]
configure:2607:3: warning: incompatible implicit declaration of built-in function 'exit'
configure:2607:3: note: include '<stdlib.h>' or provide a declaration of 'exit'
configure:2599:1:
configure:2607:3:
configure:2639: checking size of long long
configure:2708: gcc -o conftest -g3 -march=native -std=gnu11 -U__STRICT_ANSI__ -g3 -D_XOPEN_SOURCE -D_XOPEN_SOURCE_EXTENDED -U__STRICT_ANSI__  conftest.c  1>&5
configure:2729: checking size of long int
configure:2798: gcc -o conftest -g3 -march=native -std=gnu11 -U__STRICT_ANSI__ -g3 -D_XOPEN_SOURCE -D_XOPEN_SOURCE_EXTENDED -U__STRICT_ANSI__  conftest.c  1>&5
configure:2819: checking size of int
configure:2888: gcc -o conftest -g3 -march=native -std=gnu11 -U__STRICT_ANSI__ -g3 -D_XOPEN_SOURCE -D_XOPEN_SOURCE_EXTENDED -U__STRICT_ANSI__  conftest.c  1>&5
configure:2909: checking size of short int
configure:2978: gcc -o conftest -g3 -march=native -std=gnu11 -U__STRICT_ANSI__ -g3 -D_XOPEN_SOURCE -D_XOPEN_SOURCE_EXTENDED -U__STRICT_ANSI__  conftest.c  1>&5
configure:3001: checking size of long double
configure:3070: gcc -o conftest -g3 -march=native -std=gnu11 -U__STRICT_ANSI__ -g3 -D_XOPEN_SOURCE -D_XOPEN_SOURCE_EXTENDED -U__STRICT_ANSI__  conftest.c  1>&5
configure:3091: checking size of double
configure:3160: gcc -o conftest -g3 -march=native -std=gnu11 -U__STRICT_ANSI__ -g3 -D_XOPEN_SOURCE -D_XOPEN_SOURCE_EXTENDED -U__STRICT_ANSI__  conftest.c  1>&5
configure:3181: checking size of float
configure:3250: gcc -o conftest -g3 -march=native -std=gnu11 -U__STRICT_ANSI__ -g3 -D_XOPEN_SOURCE -D_XOPEN_SOURCE_EXTENDED -U__STRICT_ANSI__  conftest.c  1>&5
configure:3273: checking size of char *
configure:3342: gcc -o conftest -g3 -march=native -std=gnu11 -U__STRICT_ANSI__ -g3 -D_XOPEN_SOURCE -D_XOPEN_SOURCE_EXTENDED -U__STRICT_ANSI__  conftest.c  1>&5
configure:3377: checking for the null device
configure:3441: checking for gethostbyname
configure:3469: gcc -o conftest -g3 -march=native -std=gnu11 -U__STRICT_ANSI__ -g3 -D_XOPEN_SOURCE -D_XOPEN_SOURCE_EXTENDED -U__STRICT_ANSI__  conftest.c  -L.  >&5
configure:3542: checking whether mode_t is defined
configure:3557: gcc -c -g3 -march=native -std=gnu11 -U__STRICT_ANSI__ -g3 -D_XOPEN_SOURCE -D_XOPEN_SOURCE_EXTENDED -U__STRICT_ANSI__ conftest.c 1>&5
configure:3583: checking for availability of gettimeofday timing
configure:3596: gcc -o conftest -g3 -march=native -std=gnu11 -U__STRICT_ANSI__ -g3 -D_XOPEN_SOURCE -D_XOPEN_SOURCE_EXTENDED -U__STRICT_ANSI__  conftest.c  -L.  >&5
configure: In function 'main':
configure:3591:1: warning: implicit declaration of function 'gettimeofday' [-Wimplicit-function-declaration]
configure:3618: checking if gettimeofday needs timezone
configure:3636: gcc -o conftest -g3 -march=native -std=gnu11 -U__STRICT_ANSI__ -g3 -D_XOPEN_SOURCE -D_XOPEN_SOURCE_EXTENDED -U__STRICT_ANSI__  conftest.c  -L.  >&5
configure: In function 'main':
configure:3629:18: error: storage size of 'tzp' isn't known
configure: failed program was:
#line 3623 "configure"
#include "confdefs.h"
#include <stdio.h>
#include <sys/time.h>
#include <unistd.h>
int main() {
struct timeval tp;
 struct timezone tzp;
 gettimeofday(&tp, &tzp);
 printf("%f\n", (double)(tp.tv_sec + (double)tp.tv_usec/1000000.0));
 return 0;
; return 0; }
configure:3659: checking for availability of getrusage timing
configure:3677: gcc -o conftest -g3 -march=native -std=gnu11 -U__STRICT_ANSI__ -g3 -D_XOPEN_SOURCE -D_XOPEN_SOURCE_EXTENDED -U__STRICT_ANSI__  conftest.c  -L.  >&5
configure:3699: checking for availability of _ftime timing
configure:3717: gcc -o conftest -g3 -march=native -std=gnu11 -U__STRICT_ANSI__ -g3 -D_XOPEN_SOURCE -D_XOPEN_SOURCE_EXTENDED -U__STRICT_ANSI__  conftest.c  -L.  >&5
configure: In function 'main':
configure:3710:17: error: storage size of 'timebs' isn't known
configure:3711:3: warning: implicit declaration of function '_ftime'; did you mean 'ftime'? [-Wimplicit-function-declaration]
configure: failed program was:
#line 3704 "configure"
#include "confdefs.h"
#include <stdio.h>
#include <time.h>
#include <sys/types.h>
#include <sys/timeb.h>
int main() {
  struct _timeb timebs;
  _ftime(&timebs);
  printf("%f\n",(double)(timebs.time + timebs.millitm/1000.0));
  return 0;
; return 0; }
configure:3744: checking for time.h
configure:3757: gcc -c -g3 -march=native -std=gnu11 -U__STRICT_ANSI__ -g3 -D_XOPEN_SOURCE -D_XOPEN_SOURCE_EXTENDED -U__STRICT_ANSI__ conftest.c 1>&5
configure:3784: checking for sys/time.h
configure:3797: gcc -c -g3 -march=native -std=gnu11 -U__STRICT_ANSI__ -g3 -D_XOPEN_SOURCE -D_XOPEN_SOURCE_EXTENDED -U__STRICT_ANSI__ conftest.c 1>&5
configure:3824: checking for sys/types.h
configure:3837: gcc -c -g3 -march=native -std=gnu11 -U__STRICT_ANSI__ -g3 -D_XOPEN_SOURCE -D_XOPEN_SOURCE_EXTENDED -U__STRICT_ANSI__ conftest.c 1>&5
configure:3864: checking for unistd.h
configure:3877: gcc -c -g3 -march=native -std=gnu11 -U__STRICT_ANSI__ -g3 -D_XOPEN_SOURCE -D_XOPEN_SOURCE_EXTENDED -U__STRICT_ANSI__ conftest.c 1>&5
configure:3904: checking for string.h
configure:3917: gcc -c -g3 -march=native -std=gnu11 -U__STRICT_ANSI__ -g3 -D_XOPEN_SOURCE -D_XOPEN_SOURCE_EXTENDED -U__STRICT_ANSI__ conftest.c 1>&5
configure:3944: checking for assert.h
configure:3957: gcc -c -g3 -march=native -std=gnu11 -U__STRICT_ANSI__ -g3 -D_XOPEN_SOURCE -D_XOPEN_SOURCE_EXTENDED -U__STRICT_ANSI__ conftest.c 1>&5
configure:3984: checking for tgmath.h
configure:3997: gcc -c -g3 -march=native -std=gnu11 -U__STRICT_ANSI__ -g3 -D_XOPEN_SOURCE -D_XOPEN_SOURCE_EXTENDED -U__STRICT_ANSI__ conftest.c 1>&5
configure:4024: checking for sys/stat.h
configure:4037: gcc -c -g3 -march=native -std=gnu11 -U__STRICT_ANSI__ -g3 -D_XOPEN_SOURCE -D_XOPEN_SOURCE_EXTENDED -U__STRICT_ANSI__ conftest.c 1>&5
configure:4064: checking for getopt.h
configure:4077: gcc -c -g3 -march=native -std=gnu11 -U__STRICT_ANSI__ -g3 -D_XOPEN_SOURCE -D_XOPEN_SOURCE_EXTENDED -U__STRICT_ANSI__ conftest.c 1>&5
configure:4104: checking for dirent.h
configure:4117: gcc -c -g3 -march=native -std=gnu11 -U__STRICT_ANSI__ -g3 -D_XOPEN_SOURCE -D_XOPEN_SOURCE_EXTENDED -U__STRICT_ANSI__ conftest.c 1>&5
configure:4144: checking for c_asm.h
configure:4157: gcc -c -g3 -march=native -std=gnu11 -U__STRICT_ANSI__ -g3 -D_XOPEN_SOURCE -D_XOPEN_SOURCE_EXTENDED -U__STRICT_ANSI__ conftest.c 1>&5
configure:4151:10: fatal error: c_asm.h: No such file or directory
compilation terminated.
configure: failed program was:
#line 4149 "configure"
#include "confdefs.h"
 
#include <c_asm.h>
int main() {
 
; return 0; }
configure:4184: checking for intrinsics.h
configure:4197: gcc -c -g3 -march=native -std=gnu11 -U__STRICT_ANSI__ -g3 -D_XOPEN_SOURCE -D_XOPEN_SOURCE_EXTENDED -U__STRICT_ANSI__ conftest.c 1>&5
configure:4191:10: fatal error: intrinsics.h: No such file or directory
compilation terminated.
configure: failed program was:
#line 4189 "configure"
#include "confdefs.h"
 
#include <intrinsics.h>
int main() {
 
; return 0; }
configure:4224: checking for mach/mach_time.h
configure:4237: gcc -c -g3 -march=native -std=gnu11 -U__STRICT_ANSI__ -g3 -D_XOPEN_SOURCE -D_XOPEN_SOURCE_EXTENDED -U__STRICT_ANSI__ conftest.c 1>&5
configure:4231:10: fatal error: mach/mach_time.h: No such file or directory
compilation terminated.
configure: failed program was:
#line 4229 "configure"
#include "confdefs.h"
 
#include <mach/mach_time.h>
int main() {
 
; return 0; }
configure:4261: checking for regex.h
configure:4274: gcc -c -g3 -march=native -std=gnu11 -U__STRICT_ANSI__ -g3 -D_XOPEN_SOURCE -D_XOPEN_SOURCE_EXTENDED -U__STRICT_ANSI__ conftest.c 1>&5
configure:4299: checking for sys/filio.h
configure:4314: gcc -c -g3 -march=native -std=gnu11 -U__STRICT_ANSI__ -g3 -D_XOPEN_SOURCE -D_XOPEN_SOURCE_EXTENDED -U__STRICT_ANSI__ conftest.c 1>&5
configure:4308:10: fatal error: sys/filio.h: No such file or directory
compilation terminated.
configure: failed program was:
#line 4304 "configure"
#include "confdefs.h"
#ifdef HAVE_SYS_TYPES_H
#include <sys/types.h>
#endif 
#include <sys/filio.h>
int main() {
 
; return 0; }
configure:4341: checking for sys/ioctl.h
configure:4356: gcc -c -g3 -march=native -std=gnu11 -U__STRICT_ANSI__ -g3 -D_XOPEN_SOURCE -D_XOPEN_SOURCE_EXTENDED -U__STRICT_ANSI__ conftest.c 1>&5
configure:4383: checking for sys/socket.h
configure:4398: gcc -c -g3 -march=native -std=gnu11 -U__STRICT_ANSI__ -g3 -D_XOPEN_SOURCE -D_XOPEN_SOURCE_EXTENDED -U__STRICT_ANSI__ conftest.c 1>&5
configure:4425: checking for netinet/in.h
configure:4440: gcc -c -g3 -march=native -std=gnu11 -U__STRICT_ANSI__ -g3 -D_XOPEN_SOURCE -D_XOPEN_SOURCE_EXTENDED -U__STRICT_ANSI__ conftest.c 1>&5
configure:4467: checking for netdb.h
configure:4482: gcc -c -g3 -march=native -std=gnu11 -U__STRICT_ANSI__ -g3 -D_XOPEN_SOURCE -D_XOPEN_SOURCE_EXTENDED -U__STRICT_ANSI__ conftest.c 1>&5
configure:4509: checking for arpa/inet.h
configure:4524: gcc -c -g3 -march=native -std=gnu11 -U__STRICT_ANSI__ -g3 -D_XOPEN_SOURCE -D_XOPEN_SOURCE_EXTENDED -U__STRICT_ANSI__ conftest.c 1>&5
configure:4551: checking for winsock2.h
configure:4564: gcc -c -g3 -march=native -std=gnu11 -U__STRICT_ANSI__ -g3 -D_XOPEN_SOURCE -D_XOPEN_SOURCE_EXTENDED -U__STRICT_ANSI__ conftest.c 1>&5
configure:4558:10: fatal error: winsock2.h: No such file or directory
compilation terminated.
configure: failed program was:
#line 4556 "configure"
#include "confdefs.h"
 
#include <winsock2.h>
int main() {
 
; return 0; }
configure:4591: checking for crypt.h
configure:4606: gcc -c -g3 -march=native -std=gnu11 -U__STRICT_ANSI__ -g3 -D_XOPEN_SOURCE -D_XOPEN_SOURCE_EXTENDED -U__STRICT_ANSI__ conftest.c 1>&5
configure:4633: checking for signal.h
configure:4646: gcc -c -g3 -march=native -std=gnu11 -U__STRICT_ANSI__ -g3 -D_XOPEN_SOURCE -D_XOPEN_SOURCE_EXTENDED -U__STRICT_ANSI__ conftest.c 1>&5
configure:4673: checking for malloc.h
configure:4686: gcc -c -g3 -march=native -std=gnu11 -U__STRICT_ANSI__ -g3 -D_XOPEN_SOURCE -D_XOPEN_SOURCE_EXTENDED -U__STRICT_ANSI__ conftest.c 1>&5
configure:4713: checking for sched.h
configure:4726: gcc -c -g3 -march=native -std=gnu11 -U__STRICT_ANSI__ -g3 -D_XOPEN_SOURCE -D_XOPEN_SOURCE_EXTENDED -U__STRICT_ANSI__ conftest.c 1>&5
configure:4753: checking for execinfo.h
configure:4766: gcc -c -g3 -march=native -std=gnu11 -U__STRICT_ANSI__ -g3 -D_XOPEN_SOURCE -D_XOPEN_SOURCE_EXTENDED -U__STRICT_ANSI__ conftest.c 1>&5
configure:4791: checking whether time.h and sys/time.h may both be included
configure:4805: gcc -c -g3 -march=native -std=gnu11 -U__STRICT_ANSI__ -g3 -D_XOPEN_SOURCE -D_XOPEN_SOURCE_EXTENDED -U__STRICT_ANSI__ conftest.c 1>&5
configure:4830: checking whether socklen_t is defined
configure:4855: gcc -c -g3 -march=native -std=gnu11 -U__STRICT_ANSI__ -g3 -D_XOPEN_SOURCE -D_XOPEN_SOURCE_EXTENDED -U__STRICT_ANSI__ conftest.c 1>&5
configure:4880: checking whether SOCKET is defined
configure:4905: gcc -c -g3 -march=native -std=gnu11 -U__STRICT_ANSI__ -g3 -D_XOPEN_SOURCE -D_XOPEN_SOURCE_EXTENDED -U__STRICT_ANSI__ conftest.c 1>&5
configure: In function 'main':
configure:4901:1: error: unknown type name 'SOCKET'
configure: failed program was:
#line 4885 "configure"
#include "confdefs.h"
#include <stdio.h>
#include <stdlib.h>
#ifdef HAVE_UNISTD_H
#include <unistd.h>
#endif
#ifdef HAVE_SYS_TYPES_H
#include <sys/types.h>
#endif
#ifdef HAVE_SYS_SOCKET_H
#include <sys/socket.h>
#endif
#ifdef HAVE_WINSOCK2_H
#include <winsock2.h>
#endif
int main() {
SOCKET foo; return 0
; return 0; }
configure:4931: checking for hrtime_t
configure:4967: checking for gethrtime
configure:4995: gcc -o conftest -g3 -march=native -std=gnu11 -U__STRICT_ANSI__ -g3 -D_XOPEN_SOURCE -D_XOPEN_SOURCE_EXTENDED -U__STRICT_ANSI__  conftest.c  -L.  >&5
/tmp/ccf9tLo3.o: In function `main':
/home/shamims.iiserb/ET_debug4/Cactus/configs/sim/config-data/configure:4989: undefined reference to `gethrtime'
collect2: error: ld returned 1 exit status
configure: failed program was:
#line 4972 "configure"
#include "confdefs.h"
/* System header to define __stub macros and hopefully few prototypes,
    which can conflict with char gethrtime(); below.  */
#include <assert.h>
/* Override any gcc2 internal prototype to avoid an error.  */
/* We use char because int might match the return type of a gcc2
    builtin and then its argument prototype would still apply.  */
char gethrtime();

int main() {

/* The GNU C library defines this for functions which it implements
    to always fail with ENOSYS.  Some functions are actually named
    something starting with __ and the normal name is an alias.  */
#if defined (__stub_gethrtime) || defined (__stub___gethrtime)
choke me
#else
gethrtime();
#endif

; return 0; }
configure:4967: checking for read_real_time
configure:4995: gcc -o conftest -g3 -march=native -std=gnu11 -U__STRICT_ANSI__ -g3 -D_XOPEN_SOURCE -D_XOPEN_SOURCE_EXTENDED -U__STRICT_ANSI__  conftest.c  -L.  >&5
/tmp/ccUmMN2E.o: In function `main':
/home/shamims.iiserb/ET_debug4/Cactus/configs/sim/config-data/configure:4989: undefined reference to `read_real_time'
collect2: error: ld returned 1 exit status
configure: failed program was:
#line 4972 "configure"
#include "confdefs.h"
/* System header to define __stub macros and hopefully few prototypes,
    which can conflict with char read_real_time(); below.  */
#include <assert.h>
/* Override any gcc2 internal prototype to avoid an error.  */
/* We use char because int might match the return type of a gcc2
    builtin and then its argument prototype would still apply.  */
char read_real_time();

int main() {

/* The GNU C library defines this for functions which it implements
    to always fail with ENOSYS.  Some functions are actually named
    something starting with __ and the normal name is an alias.  */
#if defined (__stub_read_real_time) || defined (__stub___read_real_time)
choke me
#else
read_real_time();
#endif

; return 0; }
configure:4967: checking for time_base_to_time
configure:4995: gcc -o conftest -g3 -march=native -std=gnu11 -U__STRICT_ANSI__ -g3 -D_XOPEN_SOURCE -D_XOPEN_SOURCE_EXTENDED -U__STRICT_ANSI__  conftest.c  -L.  >&5
/tmp/ccukqEFo.o: In function `main':
/home/shamims.iiserb/ET_debug4/Cactus/configs/sim/config-data/configure:4989: undefined reference to `time_base_to_time'
collect2: error: ld returned 1 exit status
configure: failed program was:
#line 4972 "configure"
#include "confdefs.h"
/* System header to define __stub macros and hopefully few prototypes,
    which can conflict with char time_base_to_time(); below.  */
#include <assert.h>
/* Override any gcc2 internal prototype to avoid an error.  */
/* We use char because int might match the return type of a gcc2
    builtin and then its argument prototype would still apply.  */
char time_base_to_time();

int main() {

/* The GNU C library defines this for functions which it implements
    to always fail with ENOSYS.  Some functions are actually named
    something starting with __ and the normal name is an alias.  */
#if defined (__stub_time_base_to_time) || defined (__stub___time_base_to_time)
choke me
#else
time_base_to_time();
#endif

; return 0; }
configure:4967: checking for clock_gettime
configure:4995: gcc -o conftest -g3 -march=native -std=gnu11 -U__STRICT_ANSI__ -g3 -D_XOPEN_SOURCE -D_XOPEN_SOURCE_EXTENDED -U__STRICT_ANSI__  conftest.c  -L.  >&5
configure:4967: checking for mach_absolute_time
configure:4995: gcc -o conftest -g3 -march=native -std=gnu11 -U__STRICT_ANSI__ -g3 -D_XOPEN_SOURCE -D_XOPEN_SOURCE_EXTENDED -U__STRICT_ANSI__  conftest.c  -L.  >&5
/tmp/cc9TQa1P.o: In function `main':
/home/shamims.iiserb/ET_debug4/Cactus/configs/sim/config-data/configure:4989: undefined reference to `mach_absolute_time'
collect2: error: ld returned 1 exit status
configure: failed program was:
#line 4972 "configure"
#include "confdefs.h"
/* System header to define __stub macros and hopefully few prototypes,
    which can conflict with char mach_absolute_time(); below.  */
#include <assert.h>
/* Override any gcc2 internal prototype to avoid an error.  */
/* We use char because int might match the return type of a gcc2
    builtin and then its argument prototype would still apply.  */
char mach_absolute_time();

int main() {

/* The GNU C library defines this for functions which it implements
    to always fail with ENOSYS.  Some functions are actually named
    something starting with __ and the normal name is an alias.  */
#if defined (__stub_mach_absolute_time) || defined (__stub___mach_absolute_time)
choke me
#else
mach_absolute_time();
#endif

; return 0; }
configure:5021: checking for _rtc intrinsic
configure:5033: gcc -o conftest -g3 -march=native -std=gnu11 -U__STRICT_ANSI__ -g3 -D_XOPEN_SOURCE -D_XOPEN_SOURCE_EXTENDED -U__STRICT_ANSI__  conftest.c  -L.  >&5
configure: In function 'main':
configure:5029:1: warning: implicit declaration of function '_rtc' [-Wimplicit-function-declaration]
/tmp/ccQJTt9r.o: In function `main':
/home/shamims.iiserb/ET_debug4/Cactus/configs/sim/config-data/configure:5029: undefined reference to `_rtc'
collect2: error: ld returned 1 exit status
configure: failed program was:
#line 5024 "configure"
#include "confdefs.h"
#ifdef HAVE_INTRINSICS_H
#include <intrinsics.h>
#endif
int main() {
_rtc()
; return 0; }
configure:5054: checking for mallinfo
configure:5082: gcc -o conftest -g3 -march=native -std=gnu11 -U__STRICT_ANSI__ -g3 -D_XOPEN_SOURCE -D_XOPEN_SOURCE_EXTENDED -U__STRICT_ANSI__  conftest.c  -L.  >&5
configure:5111: checking for mallopt
configure:5139: gcc -o conftest -g3 -march=native -std=gnu11 -U__STRICT_ANSI__ -g3 -D_XOPEN_SOURCE -D_XOPEN_SOURCE_EXTENDED -U__STRICT_ANSI__  conftest.c  -L.  >&5
configure:5166: checking for malloc_info
configure:5194: gcc -o conftest -g3 -march=native -std=gnu11 -U__STRICT_ANSI__ -g3 -D_XOPEN_SOURCE -D_XOPEN_SOURCE_EXTENDED -U__STRICT_ANSI__  conftest.c  -L.  >&5
configure:5217: checking whether M_MMAP_THRESHOLD is defined
configure:5232: gcc -c -g3 -march=native -std=gnu11 -U__STRICT_ANSI__ -g3 -D_XOPEN_SOURCE -D_XOPEN_SOURCE_EXTENDED -U__STRICT_ANSI__ conftest.c 1>&5
configure:5259: checking for sched_getaffinity
configure:5287: gcc -o conftest -g3 -march=native -std=gnu11 -U__STRICT_ANSI__ -g3 -D_XOPEN_SOURCE -D_XOPEN_SOURCE_EXTENDED -U__STRICT_ANSI__  conftest.c  -L.  >&5
configure:5316: checking for getpid
configure:5344: gcc -o conftest -g3 -march=native -std=gnu11 -U__STRICT_ANSI__ -g3 -D_XOPEN_SOURCE -D_XOPEN_SOURCE_EXTENDED -U__STRICT_ANSI__  conftest.c  -L.  >&5
configure:5373: checking if __int64 is defined
configure:5385: gcc -c -g3 -march=native -std=gnu11 -U__STRICT_ANSI__ -g3 -D_XOPEN_SOURCE -D_XOPEN_SOURCE_EXTENDED -U__STRICT_ANSI__ conftest.c 1>&5
configure: In function 'main':
configure:5381:1: error: unknown type name '__int64'; did you mean '__int128'?
configure: failed program was:
#line 5378 "configure"
#include "confdefs.h"

int main() {
__int64 foo; return 0
; return 0; }
configure:5407: checking if __int128 is defined
configure:5419: gcc -c -g3 -march=native -std=gnu11 -U__STRICT_ANSI__ -g3 -D_XOPEN_SOURCE -D_XOPEN_SOURCE_EXTENDED -U__STRICT_ANSI__ conftest.c 1>&5
configure:5454: checking for vector
configure:5467: g++ -c -g3 -march=native -std=gnu11 -U__STRICT_ANSI__ -g3 -D_XOPEN_SOURCE -D_XOPEN_SOURCE_EXTENDED -U__STRICT_ANSI__ conftest.C 1>&5
cc1plus: warning: command line option '-std=gnu11' is valid for C/ObjC but not for C++
configure:5454: checking for vector.h
configure:5467: g++ -c -g3 -march=native -std=gnu11 -U__STRICT_ANSI__ -g3 -D_XOPEN_SOURCE -D_XOPEN_SOURCE_EXTENDED -U__STRICT_ANSI__ conftest.C 1>&5
cc1plus: warning: command line option '-std=gnu11' is valid for C/ObjC but not for C++
configure:5461:10: fatal error: vector.h: No such file or directory
compilation terminated.
configure: failed program was:
#line 5459 "configure"
#include "confdefs.h"
 
#include <vector.h>
int main() {
 
; return 0; }
configure:5501: checking if Intel compiler has broken restrict
configure:5519: gcc -c -g3 -march=native -std=gnu11 -U__STRICT_ANSI__ -g3 -D_XOPEN_SOURCE -D_XOPEN_SOURCE_EXTENDED -U__STRICT_ANSI__ conftest.c 1>&5
configure:5547: g++ -c -g3 -march=native -std=gnu11 -U__STRICT_ANSI__ -g3 -D_XOPEN_SOURCE -D_XOPEN_SOURCE_EXTENDED -U__STRICT_ANSI__ conftest.C 1>&5
cc1plus: warning: command line option '-std=gnu11' is valid for C/ObjC but not for C++
configure:5577: checking if compiler has broken omp collapse
configure:5595: gcc -c -g3 -march=native -std=gnu11 -U__STRICT_ANSI__ -g3 -D_XOPEN_SOURCE -D_XOPEN_SOURCE_EXTENDED -U__STRICT_ANSI__ conftest.c 1>&5
configure:5622: g++ -c -g3 -march=native -std=gnu11 -U__STRICT_ANSI__ -g3 -D_XOPEN_SOURCE -D_XOPEN_SOURCE_EXTENDED -U__STRICT_ANSI__ conftest.C 1>&5
cc1plus: warning: command line option '-std=gnu11' is valid for C/ObjC but not for C++
configure:5667: checking for getopt_long_only
configure:5695: gcc -o conftest -g3 -march=native -std=gnu11 -U__STRICT_ANSI__ -g3 -D_XOPEN_SOURCE -D_XOPEN_SOURCE_EXTENDED -U__STRICT_ANSI__  conftest.c  -L.  >&5
configure:5738: checking for working const
configure:5792: gcc -c -g3 -march=native -std=gnu11 -U__STRICT_ANSI__ -g3 -D_XOPEN_SOURCE -D_XOPEN_SOURCE_EXTENDED -U__STRICT_ANSI__ conftest.c 1>&5
configure:5814: checking for C inline
configure:5828: gcc -c -g3 -march=native -std=gnu11 -U__STRICT_ANSI__ -g3 -D_XOPEN_SOURCE -D_XOPEN_SOURCE_EXTENDED -U__STRICT_ANSI__ conftest.c 1>&5
configure:5874: checking for C static inline
configure:5896: gcc -o conftest -g3 -march=native -std=gnu11 -U__STRICT_ANSI__ -g3 -D_XOPEN_SOURCE -D_XOPEN_SOURCE_EXTENDED -U__STRICT_ANSI__  conftest.c  -L.  >&5 conftest2.c
configure:5884:18: warning: return type defaults to 'int' [-Wimplicit-int]
configure:5884:27: warning: return type defaults to 'int' [-Wimplicit-int]
configure:5892:18: warning: return type defaults to 'int' [-Wimplicit-int]
configure:5892:27: warning: return type defaults to 'int' [-Wimplicit-int]
configure:5922: checking for C restrict
configure:5954: gcc -c -g3 -march=native -std=gnu11 -U__STRICT_ANSI__ -g3 -D_XOPEN_SOURCE -D_XOPEN_SOURCE_EXTENDED -U__STRICT_ANSI__ conftest.c 1>&5
configure:5984: checking for C++ restrict
configure:6024: g++ -c -g3 -march=native -std=gnu11 -U__STRICT_ANSI__ -g3 -D_XOPEN_SOURCE -D_XOPEN_SOURCE_EXTENDED -U__STRICT_ANSI__ conftest.C 1>&5
cc1plus: warning: command line option '-std=gnu11' is valid for C/ObjC but not for C++
configure:6001:19: error: expected initializer before 'p1'
configure:6002:19: error: expected initializer before 'p2'
configure:6003:20: error: expected ';' at end of member declaration
configure:6003:29: error: 'arr' does not name a type
configure:6004:20: error: expected ';' at end of member declaration
configure:6004:29: error: 'arr' does not name a type
configure:6005:26: error: expected ',' or '...' before 'p'
configure:6006:26: error: expected ',' or '...' before 'p'
configure:6007:26: error: expected ',' or '...' before 'p'
configure:6010:26: error: expected ',' or '...' before 'p'
configure:6011:26: error: expected ',' or '...' before 'p'
configure:6012:26: error: expected ',' or '...' before 'p'
configure: In function 'int main()':
configure:6018:19: error: expected initializer before 'v1'
configure:6019:19: error: expected initializer before 'v2'
configure: failed program was:
#line 5999 "configure"
#include "confdefs.h"

double * restrict p1;
double * restrict p2[3];
struct s1 { char * restrict arr; };
struct s2 { char * restrict arr[3]; };
void f1 (void * restrict p);
void f2 (void * restrict p[]);
void f3 (void * restrict p[3]);
// void f4 (void * restrict p[restrict]);
// void f5 (void * restrict p[restrict 3]);
void f1 (void * restrict p) { }
void f2 (void * restrict p[]) { }
void f3 (void * restrict p[3]) { }
// void f4 (void * restrict p[restrict]) { }
// void f5 (void * restrict p[restrict 3]) { }

int main() {

double * restrict v1;
double * restrict v2[3];

; return 0; }
configure:6024: g++ -c -g3 -march=native -std=gnu11 -U__STRICT_ANSI__ -g3 -D_XOPEN_SOURCE -D_XOPEN_SOURCE_EXTENDED -U__STRICT_ANSI__ conftest.C 1>&5
cc1plus: warning: command line option '-std=gnu11' is valid for C/ObjC but not for C++
configure:6065: checking for C++ copysign
configure:6106: g++ -c -g3 -march=native -std=gnu11 -U__STRICT_ANSI__ -g3 -D_XOPEN_SOURCE -D_XOPEN_SOURCE_EXTENDED -U__STRICT_ANSI__ conftest.C 1>&5
cc1plus: warning: command line option '-std=gnu11' is valid for C/ObjC but not for C++
configure: In function 'int main()':
configure:6094:22: error: no matching function for call to 'copysign(float)'
In file included from configure:6088:
/home/opt_ohpc_pub/compiler/gcc/8.3.0/include/c++/8.3.0/cmath:1286:3: note: candidate: 'constexpr float std::copysign(float, float)'
   copysign(float __x, float __y)
   ^~~~~~~~
/home/opt_ohpc_pub/compiler/gcc/8.3.0/include/c++/8.3.0/cmath:1286:3: note:   candidate expects 2 arguments, 1 provided
/home/opt_ohpc_pub/compiler/gcc/8.3.0/include/c++/8.3.0/cmath:1290:3: note: candidate: 'constexpr long double std::copysign(long double, long double)'
   copysign(long double __x, long double __y)
   ^~~~~~~~
/home/opt_ohpc_pub/compiler/gcc/8.3.0/include/c++/8.3.0/cmath:1290:3: note:   candidate expects 2 arguments, 1 provided
/home/opt_ohpc_pub/compiler/gcc/8.3.0/include/c++/8.3.0/cmath:1297:5: note: candidate: 'template<class _Tp, class _Up> constexpr typename __gnu_cxx::__promote_2<_Tp, _Up>::__type std::copysign(_Tp, _Up)'
     copysign(_Tp __x, _Up __y)
     ^~~~~~~~
/home/opt_ohpc_pub/compiler/gcc/8.3.0/include/c++/8.3.0/cmath:1297:5: note:   template argument deduction/substitution failed:
configure:6094:22: note:   candidate expects 2 arguments, 1 provided
In file included from /usr/include/features.h:375,
                 from /home/opt_ohpc_pub/compiler/gcc/8.3.0/include/c++/8.3.0/x86_64-pc-linux-gnu/bits/os_defines.h:39,
                 from /home/opt_ohpc_pub/compiler/gcc/8.3.0/include/c++/8.3.0/x86_64-pc-linux-gnu/bits/c++config.h:508,
                 from /home/opt_ohpc_pub/compiler/gcc/8.3.0/include/c++/8.3.0/cmath:41,
                 from configure:6088:
/usr/include/bits/mathcalls.h:218:1: note: candidate: 'double copysign(double, double)'
 __MATHCALLX (copysign,, (_Mdouble_ __x, _Mdouble_ __y), (__const__));
 ^~~~~~~~~~~
/usr/include/bits/mathcalls.h:218:1: note:   candidate expects 2 arguments, 1 provided
configure:6095:21: error: no matching function for call to 'copysign(double)'
In file included from configure:6088:
/home/opt_ohpc_pub/compiler/gcc/8.3.0/include/c++/8.3.0/cmath:1286:3: note: candidate: 'constexpr float std::copysign(float, float)'
   copysign(float __x, float __y)
   ^~~~~~~~
/home/opt_ohpc_pub/compiler/gcc/8.3.0/include/c++/8.3.0/cmath:1286:3: note:   candidate expects 2 arguments, 1 provided
/home/opt_ohpc_pub/compiler/gcc/8.3.0/include/c++/8.3.0/cmath:1290:3: note: candidate: 'constexpr long double std::copysign(long double, long double)'
   copysign(long double __x, long double __y)
   ^~~~~~~~
/home/opt_ohpc_pub/compiler/gcc/8.3.0/include/c++/8.3.0/cmath:1290:3: note:   candidate expects 2 arguments, 1 provided
/home/opt_ohpc_pub/compiler/gcc/8.3.0/include/c++/8.3.0/cmath:1297:5: note: candidate: 'template<class _Tp, class _Up> constexpr typename __gnu_cxx::__promote_2<_Tp, _Up>::__type std::copysign(_Tp, _Up)'
     copysign(_Tp __x, _Up __y)
     ^~~~~~~~
/home/opt_ohpc_pub/compiler/gcc/8.3.0/include/c++/8.3.0/cmath:1297:5: note:   template argument deduction/substitution failed:
configure:6095:21: note:   candidate expects 2 arguments, 1 provided
In file included from /usr/include/features.h:375,
                 from /home/opt_ohpc_pub/compiler/gcc/8.3.0/include/c++/8.3.0/x86_64-pc-linux-gnu/bits/os_defines.h:39,
                 from /home/opt_ohpc_pub/compiler/gcc/8.3.0/include/c++/8.3.0/x86_64-pc-linux-gnu/bits/c++config.h:508,
                 from /home/opt_ohpc_pub/compiler/gcc/8.3.0/include/c++/8.3.0/cmath:41,
                 from configure:6088:
/usr/include/bits/mathcalls.h:218:1: note: candidate: 'double copysign(double, double)'
 __MATHCALLX (copysign,, (_Mdouble_ __x, _Mdouble_ __y), (__const__));
 ^~~~~~~~~~~
/usr/include/bits/mathcalls.h:218:1: note:   candidate expects 2 arguments, 1 provided
configure:6099:22: error: no matching function for call to 'copysign(float)'
In file included from configure:6088:
/home/opt_ohpc_pub/compiler/gcc/8.3.0/include/c++/8.3.0/cmath:1286:3: note: candidate: 'constexpr float std::copysign(float, float)'
   copysign(float __x, float __y)
   ^~~~~~~~
/home/opt_ohpc_pub/compiler/gcc/8.3.0/include/c++/8.3.0/cmath:1286:3: note:   candidate expects 2 arguments, 1 provided
/home/opt_ohpc_pub/compiler/gcc/8.3.0/include/c++/8.3.0/cmath:1290:3: note: candidate: 'constexpr long double std::copysign(long double, long double)'
   copysign(long double __x, long double __y)
   ^~~~~~~~
/home/opt_ohpc_pub/compiler/gcc/8.3.0/include/c++/8.3.0/cmath:1290:3: note:   candidate expects 2 arguments, 1 provided
/home/opt_ohpc_pub/compiler/gcc/8.3.0/include/c++/8.3.0/cmath:1297:5: note: candidate: 'template<class _Tp, class _Up> constexpr typename __gnu_cxx::__promote_2<_Tp, _Up>::__type std::copysign(_Tp, _Up)'
     copysign(_Tp __x, _Up __y)
     ^~~~~~~~
/home/opt_ohpc_pub/compiler/gcc/8.3.0/include/c++/8.3.0/cmath:1297:5: note:   template argument deduction/substitution failed:
configure:6099:22: note:   candidate expects 2 arguments, 1 provided
In file included from /usr/include/features.h:375,
                 from /home/opt_ohpc_pub/compiler/gcc/8.3.0/include/c++/8.3.0/x86_64-pc-linux-gnu/bits/os_defines.h:39,
                 from /home/opt_ohpc_pub/compiler/gcc/8.3.0/include/c++/8.3.0/x86_64-pc-linux-gnu/bits/c++config.h:508,
                 from /home/opt_ohpc_pub/compiler/gcc/8.3.0/include/c++/8.3.0/cmath:41,
                 from configure:6088:
/usr/include/bits/mathcalls.h:218:1: note: candidate: 'double copysign(double, double)'
 __MATHCALLX (copysign,, (_Mdouble_ __x, _Mdouble_ __y), (__const__));
 ^~~~~~~~~~~
/usr/include/bits/mathcalls.h:218:1: note:   candidate expects 2 arguments, 1 provided
configure:6100:21: error: no matching function for call to 'copysign(double)'
In file included from configure:6088:
/home/opt_ohpc_pub/compiler/gcc/8.3.0/include/c++/8.3.0/cmath:1286:3: note: candidate: 'constexpr float std::copysign(float, float)'
   copysign(float __x, float __y)
   ^~~~~~~~
/home/opt_ohpc_pub/compiler/gcc/8.3.0/include/c++/8.3.0/cmath:1286:3: note:   candidate expects 2 arguments, 1 provided
/home/opt_ohpc_pub/compiler/gcc/8.3.0/include/c++/8.3.0/cmath:1290:3: note: candidate: 'constexpr long double std::copysign(long double, long double)'
   copysign(long double __x, long double __y)
   ^~~~~~~~
/home/opt_ohpc_pub/compiler/gcc/8.3.0/include/c++/8.3.0/cmath:1290:3: note:   candidate expects 2 arguments, 1 provided
/home/opt_ohpc_pub/compiler/gcc/8.3.0/include/c++/8.3.0/cmath:1297:5: note: candidate: 'template<class _Tp, class _Up> constexpr typename __gnu_cxx::__promote_2<_Tp, _Up>::__type std::copysign(_Tp, _Up)'
     copysign(_Tp __x, _Up __y)
     ^~~~~~~~
/home/opt_ohpc_pub/compiler/gcc/8.3.0/include/c++/8.3.0/cmath:1297:5: note:   template argument deduction/substitution failed:
configure:6100:21: note:   candidate expects 2 arguments, 1 provided
In file included from /usr/include/features.h:375,
                 from /home/opt_ohpc_pub/compiler/gcc/8.3.0/include/c++/8.3.0/x86_64-pc-linux-gnu/bits/os_defines.h:39,
                 from /home/opt_ohpc_pub/compiler/gcc/8.3.0/include/c++/8.3.0/x86_64-pc-linux-gnu/bits/c++config.h:508,
                 from /home/opt_ohpc_pub/compiler/gcc/8.3.0/include/c++/8.3.0/cmath:41,
                 from configure:6088:
/usr/include/bits/mathcalls.h:218:1: note: candidate: 'double copysign(double, double)'
 __MATHCALLX (copysign,, (_Mdouble_ __x, _Mdouble_ __y), (__const__));
 ^~~~~~~~~~~
/usr/include/bits/mathcalls.h:218:1: note:   candidate expects 2 arguments, 1 provided
configure: failed program was:
#line 6085 "configure"
#include "confdefs.h"

/* See note in cctk_Math.h regarding these include statements */
#include <cmath>
#include <math.h>

int main() {

{
  std::copysign (1.0f);
  std::copysign (1.0);
}
using namespace std;
{
  std::copysign (1.0f);
  std::copysign (1.0);
}

; return 0; }
configure:6106: g++ -c -g3 -march=native -std=gnu11 -U__STRICT_ANSI__ -g3 -D_XOPEN_SOURCE -D_XOPEN_SOURCE_EXTENDED -U__STRICT_ANSI__ conftest.C 1>&5
cc1plus: warning: command line option '-std=gnu11' is valid for C/ObjC but not for C++
configure:6144: checking for C++ fpclassify
configure:6185: g++ -c -g3 -march=native -std=gnu11 -U__STRICT_ANSI__ -g3 -D_XOPEN_SOURCE -D_XOPEN_SOURCE_EXTENDED -U__STRICT_ANSI__ conftest.C 1>&5
cc1plus: warning: command line option '-std=gnu11' is valid for C/ObjC but not for C++
configure:6223: checking for C++ isfinite
configure:6264: g++ -c -g3 -march=native -std=gnu11 -U__STRICT_ANSI__ -g3 -D_XOPEN_SOURCE -D_XOPEN_SOURCE_EXTENDED -U__STRICT_ANSI__ conftest.C 1>&5
cc1plus: warning: command line option '-std=gnu11' is valid for C/ObjC but not for C++
configure:6302: checking for C++ isinf
configure:6343: g++ -c -g3 -march=native -std=gnu11 -U__STRICT_ANSI__ -g3 -D_XOPEN_SOURCE -D_XOPEN_SOURCE_EXTENDED -U__STRICT_ANSI__ conftest.C 1>&5
cc1plus: warning: command line option '-std=gnu11' is valid for C/ObjC but not for C++
configure:6381: checking for C++ isnan
configure:6422: g++ -c -g3 -march=native -std=gnu11 -U__STRICT_ANSI__ -g3 -D_XOPEN_SOURCE -D_XOPEN_SOURCE_EXTENDED -U__STRICT_ANSI__ conftest.C 1>&5
cc1plus: warning: command line option '-std=gnu11' is valid for C/ObjC but not for C++
configure:6460: checking for C++ isnormal
configure:6501: g++ -c -g3 -march=native -std=gnu11 -U__STRICT_ANSI__ -g3 -D_XOPEN_SOURCE -D_XOPEN_SOURCE_EXTENDED -U__STRICT_ANSI__ conftest.C 1>&5
cc1plus: warning: command line option '-std=gnu11' is valid for C/ObjC but not for C++
configure:6539: checking for C++ signbit
configure:6580: g++ -c -g3 -march=native -std=gnu11 -U__STRICT_ANSI__ -g3 -D_XOPEN_SOURCE -D_XOPEN_SOURCE_EXTENDED -U__STRICT_ANSI__ conftest.C 1>&5
cc1plus: warning: command line option '-std=gnu11' is valid for C/ObjC but not for C++
configure:6616: checking for C _Pragma
configure:6637: gcc -c -g3 -march=native -std=gnu11 -U__STRICT_ANSI__ -g3 -D_XOPEN_SOURCE -D_XOPEN_SOURCE_EXTENDED -U__STRICT_ANSI__ conftest.c 1>&5
configure:6661: checking for C function __attribute__((__const__))
configure:6674: gcc -c -g3 -march=native -std=gnu11 -U__STRICT_ANSI__ -g3 -D_XOPEN_SOURCE -D_XOPEN_SOURCE_EXTENDED -U__STRICT_ANSI__ conftest.c 1>&5
configure:6696: checking for C++ function __attribute__((__const__))
configure:6717: g++ -c -g3 -march=native -std=gnu11 -U__STRICT_ANSI__ -g3 -D_XOPEN_SOURCE -D_XOPEN_SOURCE_EXTENDED -U__STRICT_ANSI__ conftest.C 1>&5
cc1plus: warning: command line option '-std=gnu11' is valid for C/ObjC but not for C++
configure:6746: checking for C++ member function __attribute__((__const__))
configure:6767: g++ -c -g3 -march=native -std=gnu11 -U__STRICT_ANSI__ -g3 -D_XOPEN_SOURCE -D_XOPEN_SOURCE_EXTENDED -U__STRICT_ANSI__ conftest.C 1>&5
cc1plus: warning: command line option '-std=gnu11' is valid for C/ObjC but not for C++
configure:6798: checking for C function __attribute__((__pure__))
configure:6811: gcc -c -g3 -march=native -std=gnu11 -U__STRICT_ANSI__ -g3 -D_XOPEN_SOURCE -D_XOPEN_SOURCE_EXTENDED -U__STRICT_ANSI__ conftest.c 1>&5
configure:6833: checking for C++ function __attribute__((__pure__))
configure:6854: g++ -c -g3 -march=native -std=gnu11 -U__STRICT_ANSI__ -g3 -D_XOPEN_SOURCE -D_XOPEN_SOURCE_EXTENDED -U__STRICT_ANSI__ conftest.C 1>&5
cc1plus: warning: command line option '-std=gnu11' is valid for C/ObjC but not for C++
configure:6883: checking for C++ member function __attribute__((__pure__))
configure:6904: g++ -c -g3 -march=native -std=gnu11 -U__STRICT_ANSI__ -g3 -D_XOPEN_SOURCE -D_XOPEN_SOURCE_EXTENDED -U__STRICT_ANSI__ conftest.C 1>&5
cc1plus: warning: command line option '-std=gnu11' is valid for C/ObjC but not for C++
configure:6935: checking for C data __attribute__((__common__))
configure:6948: gcc -c -g3 -march=native -std=gnu11 -U__STRICT_ANSI__ -g3 -D_XOPEN_SOURCE -D_XOPEN_SOURCE_EXTENDED -U__STRICT_ANSI__ conftest.c 1>&5
configure:6970: checking for C+ data __attribute__((__common__))
configure:6991: g++ -c -g3 -march=native -std=gnu11 -U__STRICT_ANSI__ -g3 -D_XOPEN_SOURCE -D_XOPEN_SOURCE_EXTENDED -U__STRICT_ANSI__ conftest.C 1>&5
cc1plus: warning: command line option '-std=gnu11' is valid for C/ObjC but not for C++
configure:7022: checking for C function __attribute__((__noinline__))
configure:7035: gcc -c -g3 -march=native -std=gnu11 -U__STRICT_ANSI__ -g3 -D_XOPEN_SOURCE -D_XOPEN_SOURCE_EXTENDED -U__STRICT_ANSI__ conftest.c 1>&5
configure:7057: checking for C++ function __attribute__((__noinline__))
configure:7078: g++ -c -g3 -march=native -std=gnu11 -U__STRICT_ANSI__ -g3 -D_XOPEN_SOURCE -D_XOPEN_SOURCE_EXTENDED -U__STRICT_ANSI__ conftest.C 1>&5
cc1plus: warning: command line option '-std=gnu11' is valid for C/ObjC but not for C++
configure:7107: checking for C++ member function __attribute__((__noinline__))
configure:7128: g++ -c -g3 -march=native -std=gnu11 -U__STRICT_ANSI__ -g3 -D_XOPEN_SOURCE -D_XOPEN_SOURCE_EXTENDED -U__STRICT_ANSI__ conftest.C 1>&5
cc1plus: warning: command line option '-std=gnu11' is valid for C/ObjC but not for C++
configure:7159: checking for C function __attribute__((__always_inline__))
configure:7172: gcc -c -g3 -march=native -std=gnu11 -U__STRICT_ANSI__ -g3 -D_XOPEN_SOURCE -D_XOPEN_SOURCE_EXTENDED -U__STRICT_ANSI__ conftest.c 1>&5
configure:7194: checking for C++ function __attribute__((__always_inline__))
configure:7215: g++ -c -g3 -march=native -std=gnu11 -U__STRICT_ANSI__ -g3 -D_XOPEN_SOURCE -D_XOPEN_SOURCE_EXTENDED -U__STRICT_ANSI__ conftest.C 1>&5
cc1plus: warning: command line option '-std=gnu11' is valid for C/ObjC but not for C++
configure:7244: checking for C++ member function __attribute__((__always_inline__))
configure:7265: g++ -c -g3 -march=native -std=gnu11 -U__STRICT_ANSI__ -g3 -D_XOPEN_SOURCE -D_XOPEN_SOURCE_EXTENDED -U__STRICT_ANSI__ conftest.C 1>&5
cc1plus: warning: command line option '-std=gnu11' is valid for C/ObjC but not for C++
configure:7296: checking for C __attribute__((__unused__))
configure:7309: gcc -c -g3 -march=native -std=gnu11 -U__STRICT_ANSI__ -g3 -D_XOPEN_SOURCE -D_XOPEN_SOURCE_EXTENDED -U__STRICT_ANSI__ conftest.c 1>&5
configure:7331: checking for C++ __attribute__((__unused__))
configure:7352: g++ -c -g3 -march=native -std=gnu11 -U__STRICT_ANSI__ -g3 -D_XOPEN_SOURCE -D_XOPEN_SOURCE_EXTENDED -U__STRICT_ANSI__ conftest.C 1>&5
cc1plus: warning: command line option '-std=gnu11' is valid for C/ObjC but not for C++
configure:7383: checking for C __attribute__((__aligned__(...)))
configure:7396: gcc -c -g3 -march=native -std=gnu11 -U__STRICT_ANSI__ -g3 -D_XOPEN_SOURCE -D_XOPEN_SOURCE_EXTENDED -U__STRICT_ANSI__ conftest.c 1>&5
configure:7418: checking for C++ __attribute__((__aligned__(...)))
configure:7439: g++ -c -g3 -march=native -std=gnu11 -U__STRICT_ANSI__ -g3 -D_XOPEN_SOURCE -D_XOPEN_SOURCE_EXTENDED -U__STRICT_ANSI__ conftest.C 1>&5
cc1plus: warning: command line option '-std=gnu11' is valid for C/ObjC but not for C++
configure:7470: checking for C __attribute__((__cold__))
configure:7483: gcc -c -g3 -march=native -std=gnu11 -U__STRICT_ANSI__ -g3 -D_XOPEN_SOURCE -D_XOPEN_SOURCE_EXTENDED -U__STRICT_ANSI__ conftest.c 1>&5
configure: In function 'main':
configure:7479:1: warning: 'cold' attribute ignored [-Wattributes]
configure:7505: checking for C++ __attribute__((__cold__))
configure:7526: g++ -c -g3 -march=native -std=gnu11 -U__STRICT_ANSI__ -g3 -D_XOPEN_SOURCE -D_XOPEN_SOURCE_EXTENDED -U__STRICT_ANSI__ conftest.C 1>&5
cc1plus: warning: command line option '-std=gnu11' is valid for C/ObjC but not for C++
configure: In function 'int main()':
configure:7522:38: warning: 'cold' attribute ignored [-Wattributes]
configure:7557: checking for C __attribute__((__hot__))
configure:7570: gcc -c -g3 -march=native -std=gnu11 -U__STRICT_ANSI__ -g3 -D_XOPEN_SOURCE -D_XOPEN_SOURCE_EXTENDED -U__STRICT_ANSI__ conftest.c 1>&5
configure: In function 'main':
configure:7566:1: warning: 'hot' attribute ignored [-Wattributes]
configure:7592: checking for C++ __attribute__((__hot__))
configure:7613: g++ -c -g3 -march=native -std=gnu11 -U__STRICT_ANSI__ -g3 -D_XOPEN_SOURCE -D_XOPEN_SOURCE_EXTENDED -U__STRICT_ANSI__ conftest.C 1>&5
cc1plus: warning: command line option '-std=gnu11' is valid for C/ObjC but not for C++
configure: In function 'int main()':
configure:7609:37: warning: 'hot' attribute ignored [-Wattributes]
configure:7644: checking for C __attribute__((__format__(printf, 1, 2)))
configure:7657: gcc -c -g3 -march=native -std=gnu11 -U__STRICT_ANSI__ -g3 -D_XOPEN_SOURCE -D_XOPEN_SOURCE_EXTENDED -U__STRICT_ANSI__ conftest.c 1>&5
configure:7679: checking for C++ __attribute__((__format__(printf, 1, 2)))
configure:7700: g++ -c -g3 -march=native -std=gnu11 -U__STRICT_ANSI__ -g3 -D_XOPEN_SOURCE -D_XOPEN_SOURCE_EXTENDED -U__STRICT_ANSI__ conftest.C 1>&5
cc1plus: warning: command line option '-std=gnu11' is valid for C/ObjC but not for C++
configure:7731: checking for C __attribute__((__noreturn__))
configure:7744: gcc -c -g3 -march=native -std=gnu11 -U__STRICT_ANSI__ -g3 -D_XOPEN_SOURCE -D_XOPEN_SOURCE_EXTENDED -U__STRICT_ANSI__ conftest.c 1>&5
configure:7766: checking for C++ __attribute__((__noreturn__))
configure:7787: g++ -c -g3 -march=native -std=gnu11 -U__STRICT_ANSI__ -g3 -D_XOPEN_SOURCE -D_XOPEN_SOURCE_EXTENDED -U__STRICT_ANSI__ conftest.C 1>&5
cc1plus: warning: command line option '-std=gnu11' is valid for C/ObjC but not for C++
configure:7818: checking for C __attribute__((__nonnull__))
configure:7846: gcc -c -g3 -march=native -std=gnu11 -U__STRICT_ANSI__ -g3 -D_XOPEN_SOURCE -D_XOPEN_SOURCE_EXTENDED -U__STRICT_ANSI__ conftest.c 1>&5
configure:7868: checking for C++ __attribute__((__nonnull__))
configure:7904: g++ -c -g3 -march=native -std=gnu11 -U__STRICT_ANSI__ -g3 -D_XOPEN_SOURCE -D_XOPEN_SOURCE_EXTENDED -U__STRICT_ANSI__ conftest.C 1>&5
cc1plus: warning: command line option '-std=gnu11' is valid for C/ObjC but not for C++
configure:7935: checking for C __attribute__((__returns_nonnull__))
configure:7957: gcc -c -g3 -march=native -std=gnu11 -U__STRICT_ANSI__ -g3 -D_XOPEN_SOURCE -D_XOPEN_SOURCE_EXTENDED -U__STRICT_ANSI__ conftest.c 1>&5
configure:7979: checking for C++ __attribute__((__returns_nonnull__))
configure:8009: g++ -c -g3 -march=native -std=gnu11 -U__STRICT_ANSI__ -g3 -D_XOPEN_SOURCE -D_XOPEN_SOURCE_EXTENDED -U__STRICT_ANSI__ conftest.C 1>&5
cc1plus: warning: command line option '-std=gnu11' is valid for C/ObjC but not for C++
configure:8040: checking for C __builtin_expect
configure:8053: gcc -o conftest -g3 -march=native -std=gnu11 -U__STRICT_ANSI__ -g3 -D_XOPEN_SOURCE -D_XOPEN_SOURCE_EXTENDED -U__STRICT_ANSI__  conftest.c  1>&5
configure:8075: checking for C++ __builtin_expect
configure:8096: g++ -o conftest -g3 -march=native -std=gnu11 -U__STRICT_ANSI__ -g3 -D_XOPEN_SOURCE -D_XOPEN_SOURCE_EXTENDED -U__STRICT_ANSI__  conftest.C  1>&5
cc1plus: warning: command line option '-std=gnu11' is valid for C/ObjC but not for C++
configure:8127: checking for C __builtin_trap
configure:8140: gcc -o conftest -g3 -march=native -std=gnu11 -U__STRICT_ANSI__ -g3 -D_XOPEN_SOURCE -D_XOPEN_SOURCE_EXTENDED -U__STRICT_ANSI__  conftest.c  1>&5
configure:8162: checking for C++ __builtin_trap
configure:8183: g++ -o conftest -g3 -march=native -std=gnu11 -U__STRICT_ANSI__ -g3 -D_XOPEN_SOURCE -D_XOPEN_SOURCE_EXTENDED -U__STRICT_ANSI__  conftest.C  1>&5
cc1plus: warning: command line option '-std=gnu11' is valid for C/ObjC but not for C++
configure:8214: checking for C __builtin_unreachable
configure:8227: gcc -o conftest -g3 -march=native -std=gnu11 -U__STRICT_ANSI__ -g3 -D_XOPEN_SOURCE -D_XOPEN_SOURCE_EXTENDED -U__STRICT_ANSI__  conftest.c  1>&5
configure:8249: checking for C++ __builtin_unreachable
configure:8270: g++ -o conftest -g3 -march=native -std=gnu11 -U__STRICT_ANSI__ -g3 -D_XOPEN_SOURCE -D_XOPEN_SOURCE_EXTENDED -U__STRICT_ANSI__  conftest.C  1>&5
cc1plus: warning: command line option '-std=gnu11' is valid for C/ObjC but not for C++
configure:8301: checking for C __builtin_assume_aligned
configure:8316: gcc -o conftest -g3 -march=native -std=gnu11 -U__STRICT_ANSI__ -g3 -D_XOPEN_SOURCE -D_XOPEN_SOURCE_EXTENDED -U__STRICT_ANSI__  conftest.c  1>&5
configure:8338: checking for C++ __builtin_assume_aligned
configure:8361: g++ -o conftest -g3 -march=native -std=gnu11 -U__STRICT_ANSI__ -g3 -D_XOPEN_SOURCE -D_XOPEN_SOURCE_EXTENDED -U__STRICT_ANSI__  conftest.C  1>&5
cc1plus: warning: command line option '-std=gnu11' is valid for C/ObjC but not for C++
configure:8392: checking for C++ static_assert
configure:8413: g++ -o conftest -g3 -march=native -std=gnu11 -U__STRICT_ANSI__ -g3 -D_XOPEN_SOURCE -D_XOPEN_SOURCE_EXTENDED -U__STRICT_ANSI__  conftest.C  1>&5
cc1plus: warning: command line option '-std=gnu11' is valid for C/ObjC but not for C++
configure:8444: checking for C++ auto specifier
configure:8465: g++ -o conftest -g3 -march=native -std=gnu11 -U__STRICT_ANSI__ -g3 -D_XOPEN_SOURCE -D_XOPEN_SOURCE_EXTENDED -U__STRICT_ANSI__  conftest.C  1>&5
cc1plus: warning: command line option '-std=gnu11' is valid for C/ObjC but not for C++
configure:8494: checking for C++ lambda expressions
configure:8515: g++ -o conftest -g3 -march=native -std=gnu11 -U__STRICT_ANSI__ -g3 -D_XOPEN_SOURCE -D_XOPEN_SOURCE_EXTENDED -U__STRICT_ANSI__  conftest.C  1>&5
cc1plus: warning: command line option '-std=gnu11' is valid for C/ObjC but not for C++
configure:8544: checking for C++ range-based for statements
configure:8566: g++ -o conftest -g3 -march=native -std=gnu11 -U__STRICT_ANSI__ -g3 -D_XOPEN_SOURCE -D_XOPEN_SOURCE_EXTENDED -U__STRICT_ANSI__  conftest.C  1>&5
cc1plus: warning: command line option '-std=gnu11' is valid for C/ObjC but not for C++
configure:8608: checking for Fortran REAL*4
configure:8625: gfortran -c  conftest.f 1>&5
configure:8654: checking for Fortran REAL*8
configure:8671: gfortran -c  conftest.f 1>&5
configure:8700: checking for Fortran REAL*16
configure:8717: gfortran -c  conftest.f 1>&5
configure:8747: checking for Fortran COMPLEX*8
configure:8764: gfortran -c  conftest.f 1>&5
configure:8793: checking for Fortran COMPLEX*16
configure:8810: gfortran -c  conftest.f 1>&5
configure:8839: checking for Fortran COMPLEX*32
configure:8856: gfortran -c  conftest.f 1>&5
configure:8903: checking for cxxabi.h
configure:8916: g++ -c -g3 -march=native -std=gnu11 -U__STRICT_ANSI__ -g3 -D_XOPEN_SOURCE -D_XOPEN_SOURCE_EXTENDED -U__STRICT_ANSI__ conftest.C 1>&5
cc1plus: warning: command line option '-std=gnu11' is valid for C/ObjC but not for C++
configure:8940: checking for __cxa_demangle
configure:8952: g++ -c -g3 -march=native -std=gnu11 -U__STRICT_ANSI__ -g3 -D_XOPEN_SOURCE -D_XOPEN_SOURCE_EXTENDED -U__STRICT_ANSI__ conftest.C 1>&5
cc1plus: warning: command line option '-std=gnu11' is valid for C/ObjC but not for C++
configure:8984: checking for Dl_info.dli_sname
configure:8999: gcc -c -g3 -march=native -std=gnu11 -U__STRICT_ANSI__ -g3 -D_XOPEN_SOURCE -D_XOPEN_SOURCE_EXTENDED -U__STRICT_ANSI__ conftest.c 1>&5
configure:9039: checking for dladdr
configure:9067: gcc -o conftest -g3 -march=native -std=gnu11 -U__STRICT_ANSI__ -g3 -D_XOPEN_SOURCE -D_XOPEN_SOURCE_EXTENDED -U__STRICT_ANSI__  conftest.c  -L.  >&5
/tmp/ccgggk90.o: In function `main':
/home/shamims.iiserb/ET_debug4/Cactus/configs/sim/config-data/configure:9061: undefined reference to `dladdr'
collect2: error: ld returned 1 exit status
configure: failed program was:
#line 9044 "configure"
#include "confdefs.h"
/* System header to define __stub macros and hopefully few prototypes,
    which can conflict with char dladdr(); below.  */
#include <assert.h>
/* Override any gcc2 internal prototype to avoid an error.  */
/* We use char because int might match the return type of a gcc2
    builtin and then its argument prototype would still apply.  */
char dladdr();

int main() {

/* The GNU C library defines this for functions which it implements
    to always fail with ENOSYS.  Some functions are actually named
    something starting with __ and the normal name is an alias.  */
#if defined (__stub_dladdr) || defined (__stub___dladdr)
choke me
#else
dladdr();
#endif

; return 0; }
configure:9089: checking for dladdr in library dl
configure:9109: gcc -o conftest -g3 -march=native -std=gnu11 -U__STRICT_ANSI__ -g3 -D_XOPEN_SOURCE -D_XOPEN_SOURCE_EXTENDED -U__STRICT_ANSI__  conftest.c  -L.  -ldl >&5
configure:9157: checking for backtrace
configure:9185: gcc -o conftest -g3 -march=native -std=gnu11 -U__STRICT_ANSI__ -g3 -D_XOPEN_SOURCE -D_XOPEN_SOURCE_EXTENDED -U__STRICT_ANSI__  conftest.c  -L.  -ldl >&5
configure:9215: checking for backtrace_symbols
configure:9243: gcc -o conftest -g3 -march=native -std=gnu11 -U__STRICT_ANSI__ -g3 -D_XOPEN_SOURCE -D_XOPEN_SOURCE_EXTENDED -U__STRICT_ANSI__  conftest.c  -L.  -ldl >&5
configure:9273: checking for crypt
configure:9301: gcc -o conftest -g3 -march=native -std=gnu11 -U__STRICT_ANSI__ -g3 -D_XOPEN_SOURCE -D_XOPEN_SOURCE_EXTENDED -U__STRICT_ANSI__  conftest.c  -L.  -ldl >&5
/tmp/cctAt1SM.o: In function `main':
/home/shamims.iiserb/ET_debug4/Cactus/configs/sim/config-data/configure:9295: undefined reference to `crypt'
collect2: error: ld returned 1 exit status
configure: failed program was:
#line 9278 "configure"
#include "confdefs.h"
/* System header to define __stub macros and hopefully few prototypes,
    which can conflict with char crypt(); below.  */
#include <assert.h>
/* Override any gcc2 internal prototype to avoid an error.  */
/* We use char because int might match the return type of a gcc2
    builtin and then its argument prototype would still apply.  */
char crypt();

int main() {

/* The GNU C library defines this for functions which it implements
    to always fail with ENOSYS.  Some functions are actually named
    something starting with __ and the normal name is an alias.  */
#if defined (__stub_crypt) || defined (__stub___crypt)
choke me
#else
crypt();
#endif

; return 0; }
configure:9323: checking for crypt in library crypt
configure:9343: gcc -o conftest -g3 -march=native -std=gnu11 -U__STRICT_ANSI__ -g3 -D_XOPEN_SOURCE -D_XOPEN_SOURCE_EXTENDED -U__STRICT_ANSI__  conftest.c  -L.  -lcrypt -ldl >&5
configure:9383: checking for finite in header math.h and library m
configure:9400: gcc -o conftest -g3 -march=native -std=gnu11 -U__STRICT_ANSI__ -g3 -D_XOPEN_SOURCE -D_XOPEN_SOURCE_EXTENDED -U__STRICT_ANSI__  conftest.c  -L.  -lm -lcrypt -ldl >&5
configure: In function 'main':
configure:9396:1: warning: implicit declaration of function 'finite' [-Wimplicit-function-declaration]
configure:9441: checking for copysign in header math.h and library m
configure:9458: gcc -o conftest -g3 -march=native -std=gnu11 -U__STRICT_ANSI__ -g3 -D_XOPEN_SOURCE -D_XOPEN_SOURCE_EXTENDED -U__STRICT_ANSI__  conftest.c  -L.  -lm -lm -lcrypt -ldl >&5
configure:9499: checking for fpclassify in header math.h and library m
configure:9516: gcc -o conftest -g3 -march=native -std=gnu11 -U__STRICT_ANSI__ -g3 -D_XOPEN_SOURCE -D_XOPEN_SOURCE_EXTENDED -U__STRICT_ANSI__  conftest.c  -L.  -lm -lm -lm -lcrypt -ldl >&5
configure:9557: checking for isfinite in header math.h and library m
configure:9574: gcc -o conftest -g3 -march=native -std=gnu11 -U__STRICT_ANSI__ -g3 -D_XOPEN_SOURCE -D_XOPEN_SOURCE_EXTENDED -U__STRICT_ANSI__  conftest.c  -L.  -lm -lm -lm -lm -lcrypt -ldl >&5
configure:9615: checking for isinf in header math.h and library m
configure:9632: gcc -o conftest -g3 -march=native -std=gnu11 -U__STRICT_ANSI__ -g3 -D_XOPEN_SOURCE -D_XOPEN_SOURCE_EXTENDED -U__STRICT_ANSI__  conftest.c  -L.  -lm -lm -lm -lm -lm -lcrypt -ldl >&5
configure:9673: checking for isnan in header math.h and library m
configure:9690: gcc -o conftest -g3 -march=native -std=gnu11 -U__STRICT_ANSI__ -g3 -D_XOPEN_SOURCE -D_XOPEN_SOURCE_EXTENDED -U__STRICT_ANSI__  conftest.c  -L.  -lm -lm -lm -lm -lm -lm -lcrypt -ldl >&5
configure:9731: checking for isnormal in header math.h and library m
configure:9748: gcc -o conftest -g3 -march=native -std=gnu11 -U__STRICT_ANSI__ -g3 -D_XOPEN_SOURCE -D_XOPEN_SOURCE_EXTENDED -U__STRICT_ANSI__  conftest.c  -L.  -lm -lm -lm -lm -lm -lm -lm -lcrypt -ldl >&5
configure:9789: checking for signbit in header math.h and library m
configure:9806: gcc -o conftest -g3 -march=native -std=gnu11 -U__STRICT_ANSI__ -g3 -D_XOPEN_SOURCE -D_XOPEN_SOURCE_EXTENDED -U__STRICT_ANSI__  conftest.c  -L.  -lm -lm -lm -lm -lm -lm -lm -lm -lcrypt -ldl >&5
configure:9851: checking for mkstemp
configure:9879: gcc -o conftest -g3 -march=native -std=gnu11 -U__STRICT_ANSI__ -g3 -D_XOPEN_SOURCE -D_XOPEN_SOURCE_EXTENDED -U__STRICT_ANSI__  conftest.c  -L.  -lm -lm -lm -lm -lm -lm -lm -lm -lcrypt -ldl >&5
configure:9961: checking for va_copy
configure:9973: gcc -o conftest -g3 -march=native -std=gnu11 -U__STRICT_ANSI__ -g3 -D_XOPEN_SOURCE -D_XOPEN_SOURCE_EXTENDED -U__STRICT_ANSI__  conftest.c  -L.  -lm -lm -lm -lm -lm -lm -lm -lm -lcrypt -ldl >&5
configure:10498: checking whether linker supports --whole-archive
configure:10512: gcc -o conftest -g3 -march=native -std=gnu11 -U__STRICT_ANSI__ -g3 -D_XOPEN_SOURCE -D_XOPEN_SOURCE_EXTENDED -U__STRICT_ANSI__ -Wl,--whole-archive -Wl,--no-whole-archive conftest.c  -L.  -lm -lm -lm -lm -lm -lm -lm -lm -lcrypt -ldl -lgfortran >&5
configure:10541: checking whether linker supports -filelist
configure:10555: gcc -o conftest -g3 -march=native -std=gnu11 -U__STRICT_ANSI__ -g3 -D_XOPEN_SOURCE -D_XOPEN_SOURCE_EXTENDED -U__STRICT_ANSI__ -filelist /dev/null,/ conftest.c  -L.  -lm -lm -lm -lm -lm -lm -lm -lm -lcrypt -ldl -lgfortran >&5
gcc: error: /dev/null,/: No such file or directory
gcc: error: unrecognized command line option '-filelist'; did you mean '-fident'?
configure: failed program was:
#line 10548 "configure"
#include "confdefs.h"

int main() {
return 0
; return 0; }
