------------------------------------------------------
There was 1 error during execution of the CST
This must be corrected before compilation can proceed
------------------------------------------------------
------------------------------------------------------
Warnings were generated during execution of the CST
------------------------------------------------------
CST error 1:
-> Configuration script for thorn LAPACK returned exit code 2
(no error message)
------------------------------------------------------
make[1]: *** [/Users/babiuc/ETK2020/Cactus/configs/sim/config-data/make.thornlist] Error 1
___COMPILING Carpet/LoopControl/src/type_sizes.F90
/Users/babiuc/ETK2020/Cactus/configs/sim/build/LoopControl/type_sizes.f90:57:33:
56 | type_sizes(1) = CCTK_PointerTo(vec(2)) - CCTK_PointerTo(vec(1))
| 2
57 | type_sizes(2) = CCTK_PointerTo(space(2)) - CCTK_PointerTo(space(1))
| 1
Error: Type mismatch between actual argument at (1) and actual argument at (2) (TYPE(lc_space_t)/TYPE(lc_vec_t)).
/Users/babiuc/ETK2020/Cactus/configs/sim/build/LoopControl/type_sizes.f90:57:60:
56 | type_sizes(1) = CCTK_PointerTo(vec(2)) - CCTK_PointerTo(vec(1))
| 2
57 | type_sizes(2) = CCTK_PointerTo(space(2)) - CCTK_PointerTo(space(1))
| 1
Error: Type mismatch between actual argument at (1) and actual argument at (2) (TYPE(lc_space_t)/TYPE(lc_vec_t)).
/Users/babiuc/ETK2020/Cactus/configs/sim/build/LoopControl/type_sizes.f90:58:33:
56 | type_sizes(1) = CCTK_PointerTo(vec(2)) - CCTK_PointerTo(vec(1))
| 2
57 | type_sizes(2) = CCTK_PointerTo(space(2)) - CCTK_PointerTo(space(1))
58 | type_sizes(3) = CCTK_PointerTo(control(2)) - CCTK_PointerTo(control(1))
| 1
Error: Type mismatch between actual argument at (1) and actual argument at (2) (TYPE(lc_control_t)/TYPE(lc_vec_t)).
/Users/babiuc/ETK2020/Cactus/configs/sim/build/LoopControl/type_sizes.f90:58:62:
56 | type_sizes(1) = CCTK_PointerTo(vec(2)) - CCTK_PointerTo(vec(1))
| 2
57 | type_sizes(2) = CCTK_PointerTo(space(2)) - CCTK_PointerTo(space(1))
58 | type_sizes(3) = CCTK_PointerTo(control(2)) - CCTK_PointerTo(control(1))
| 1
Error: Type mismatch between actual argument at (1) and actual argument at (2) (TYPE(lc_control_t)/TYPE(lc_vec_t)).
make[3]: *** [type_sizes.F90.o] Error 1
make[2]: *** [make.checked] Error 2
make[1]: *** [/Users/babiuc/ETK2020/Cactus/configs/sim/lib/libthorn_LoopControl.a] Error 2
make[1]: *** Waiting for unfinished jobs....
COMPILING configs/sim/bindings/build/SpaceMask/cctk_ThornBindings.c
Creating /Users/babiuc/ETK2020/Cactus/configs/sim/lib/libthorn_SpaceMask.a
make: *** [sim] Error 2
____