#1567: Lorene: compilation error when using -warn all ------------------------------------+--------------------------------------- Reporter: bmundim | Owner: Type: defect | Status: new Priority: major | Milestone: ET_2014_05 Component: EinsteinToolkit thorn | Version: ET_2013_11 Resolution: | Keywords: Lorene ExternalLibraries ------------------------------------+---------------------------------------
Comment (by bmundim):
Two of the patches provided by ET failed when patching the newest version of Lorene:
{{{ patch -p0 < des.patch patching file Lorene/C++/Source/Bin_hor/binhor_hh.C patching file Lorene/C++/Source/Isol_hor/init_data.C patching file Lorene/C++/Source/Time_slice/tslice_conf_init.C Hunk #1 succeeded at 225 (offset 2 lines). Hunk #2 succeeded at 238 (offset 2 lines). Hunk #3 succeeded at 246 (offset 2 lines). patching file Lorene/C++/Source/Time_slice/tslice_dirac_max_evolve.C Hunk #1 FAILED at 673. Hunk #2 FAILED at 695. 2 out of 2 hunks FAILED -- saving rejects to file Lorene/C++/Source/Time_slice/tslice_dirac_max_evolve.C.rej
patch -p0 < pgplot.patch patching file Lorene/C++/Makefile Hunk #1 FAILED at 40. 1 out of 1 hunk FAILED -- saving rejects to file Lorene/C++/Makefile.rej }}}
I will try to fix them, but I would appreciate if the author of these patches could let us all know what these patches are about.
Cheers, Bruno.