Hello,
my name is Vassili, i just started my PhD under the supervision of Toni font in Valencia. I am going to work with the Einstein Toolkit to do numerical simulations.
I tried installing the toolkit as described in the simplified tutorial for new users and got the following error messages when trying to compile:
Error: Unclassifiable statement at (1) /home/vass/Cactus/configs/firsttry/build/Extract/Extract.f:971.72:
GOTO 404 1 Error: Label 404 referenced at (1) is never defined /home/vass/Cactus/configs/firsttry/build/Extract/Extract.f:1393.6:
101 format(a1,a14) 1 Error: Bad continuation line at (1) /home/vass/Cactus/configs/firsttry/build/Extract/Extract.f:1393.6:
101 format(a1,a14) 1 Error: Unclassifiable statement at (1) /home/vass/Cactus/configs/firsttry/build/Extract/Extract.f:1392.29:
write(filehandle,101) char(34),filename 1 Error: FORMAT label 101 at (1) not defined /home/vass/Cactus/configs/firsttry/build/Extract/Extract.f:1694.6:
101 format(a1,a14) 1 Error: Bad continuation line at (1) /home/vass/Cactus/configs/firsttry/build/Extract/Extract.f:1694.6:
101 format(a1,a14) 1 Error: Unclassifiable statement at (1) /home/vass/Cactus/configs/firsttry/build/Extract/Extract.f:1693.22:
write(444,101) char(34),filename 1 Error: FORMAT label 101 at (1) not defined /home/vass/Cactus/configs/firsttry/build/Extract/Extract.f:1998.6:
101 format(a1,a14) 1 Error: Bad continuation line at (1) /home/vass/Cactus/configs/firsttry/build/Extract/Extract.f:1998.6:
101 format(a1,a14) 1 Error: Unclassifiable statement at (1) /home/vass/Cactus/configs/firsttry/build/Extract/Extract.f:1997.22:
write(444,101) char(34),filename 1 Error: FORMAT label 101 at (1) not defined make[3]: *** [Extract.F.o] Error 1 make[3]: *** Waiting for unfinished jobs.... Postprocessing /home/vass/Cactus/arrangements/EinsteinAnalysis/Extract/src/unphysical_to_physical.F ________________________________________________________________________ make[2]: *** [make.checked] Error 2 make[1]: *** [/home/vass/Cactus/configs/firsttry/lib/libthorn_Extract.a] Error 2 make: *** [firsttry] Error 2 vass@vass-Studio-1557:~/Cactus$ ./simfactory/bin/sim build firsttry --thornlist=manifest/einsteintoolkit.th--optionlist=/home/vass/.cactus/config
this is not exhaustive, it goes on for much longer...basically the fortran F77 files are not compiled properly...i am using ubuntu 11.04 and gfortran, but also installed g77 from the ubuntu 8.04 archives to see whether this would remove the problems...as suggested in the web, i have also used the ffppflags= -traditional option in my config file...
before, there were also other files affected by this, like the distortedBHIVP.f file....
don't know what to do, it would be great if you could point me into a direction!!
best wishes,
Vassili
Hi Vassili,
On Wed, Sep 21, 2011 at 06:47:05PM +0200, ciambridge wrote:
/home/vass/Cactus/configs/firsttry/build/Extract/Extract.f:971.72:
GOTO 404
This is strange, because this is actually defined 4 lines below this.
this is not exhaustive, it goes on for much longer...basically the fortran F77 files are not compiled properly...i am using ubuntu 11.04 and gfortran, but also installed g77 from the ubuntu 8.04 archives to see whether this would remove the problems...as suggested in the web, i have also used the ffppflags= -traditional option in my config file...
Which compiler did you use for the f77 files? I know that g77 does have problems with some thorns, but gfortran should work.
What happens without the -traditional option?
good luck, Frank
Hello Frank,
i tried both gfortran and g77, both wont compile the F77 files...also having the -traditional option on makes no difference...Erik Schnetter emailed me about opening a ticket, which i did, there i describe the problem in more detail...its quite strange i think...
thanks for your reply,
best wishes,
Vassili
Could you open a ticket on trac.einsteintoolkit.org and attach your thorn list, option file, and the screen output from Cactus when it creates a new configuration? There may be a clue in the details.
-erik
On Wed, Sep 21, 2011 at 12:47 PM, ciambridge ciambridge@googlemail.com wrote:
Hello,
my name is Vassili, i just started my PhD under the supervision of Toni font in Valencia. I am going to work with the Einstein Toolkit to do numerical simulations.
I tried installing the toolkit as described in the simplified tutorial for new users and got the following error messages when trying to compile:
Error: Unclassifiable statement at (1) /home/vass/Cactus/configs/firsttry/build/Extract/Extract.f:971.72:
GOTO 404 1 Error: Label 404 referenced at (1) is never defined /home/vass/Cactus/configs/firsttry/build/Extract/Extract.f:1393.6:
101 format(a1,a14) 1 Error: Bad continuation line at (1) /home/vass/Cactus/configs/firsttry/build/Extract/Extract.f:1393.6:
101 format(a1,a14) 1 Error: Unclassifiable statement at (1) /home/vass/Cactus/configs/firsttry/build/Extract/Extract.f:1392.29:
write(filehandle,101) char(34),filename 1 Error: FORMAT label 101 at (1) not defined /home/vass/Cactus/configs/firsttry/build/Extract/Extract.f:1694.6:
101 format(a1,a14) 1 Error: Bad continuation line at (1) /home/vass/Cactus/configs/firsttry/build/Extract/Extract.f:1694.6:
101 format(a1,a14) 1 Error: Unclassifiable statement at (1) /home/vass/Cactus/configs/firsttry/build/Extract/Extract.f:1693.22:
write(444,101) char(34),filename 1 Error: FORMAT label 101 at (1) not defined /home/vass/Cactus/configs/firsttry/build/Extract/Extract.f:1998.6:
101 format(a1,a14) 1 Error: Bad continuation line at (1) /home/vass/Cactus/configs/firsttry/build/Extract/Extract.f:1998.6:
101 format(a1,a14) 1 Error: Unclassifiable statement at (1) /home/vass/Cactus/configs/firsttry/build/Extract/Extract.f:1997.22:
write(444,101) char(34),filename 1 Error: FORMAT label 101 at (1) not defined make[3]: *** [Extract.F.o] Error 1 make[3]: *** Waiting for unfinished jobs.... Postprocessing /home/vass/Cactus/arrangements/EinsteinAnalysis/Extract/src/unphysical_to_physical.F ________________________________________________________________________ make[2]: *** [make.checked] Error 2 make[1]: *** [/home/vass/Cactus/configs/firsttry/lib/libthorn_Extract.a] Error 2 make: *** [firsttry] Error 2 vass@vass-Studio-1557:~/Cactus$ ./simfactory/bin/sim build firsttry --thornlist=manifest/einsteintoolkit.th --optionlist=/home/vass/.cactus/config
this is not exhaustive, it goes on for much longer...basically the fortran F77 files are not compiled properly...i am using ubuntu 11.04 and gfortran, but also installed g77 from the ubuntu 8.04 archives to see whether this would remove the problems...as suggested in the web, i have also used the ffppflags= -traditional option in my config file...
before, there were also other files affected by this, like the distortedBHIVP.f file....
don't know what to do, it would be great if you could point me into a direction!!
best wishes,
Vassili
Users mailing list Users@einsteintoolkit.org http://lists.einsteintoolkit.org/mailman/listinfo/users
users@lists.einsteintoolkit.org